program: Gaussian 09
title: 000294065
version: EM64L-G09RevD.01
frameworkgroup: C1[X(C20H22N2O4S)]
method: RPBEPBE
basis: SDD
operation: Freq
keyword: #p
keyword: freq=noraman
keyword: PBEPBE/SDD
title: #p freq=noraman PBEPBE/SDD
converged: YES YES NO NO
title: Mulliken charges:
elementType: S O O O O N N C C C C C C C C C C C C C C C C C C C C H H H H H H H H H H H H H H H H H H H H H H
charge: 0.160120 -0.272212 -0.218552 -0.274915 -0.330527 -0.345263 -0.370971 -0.140592 -0.698836 -0.845780 0.259949 0.251314 -0.522564 0.469564 -0.388846 -0.387531 0.212391 0.281237 -0.234204 -0.224059 -0.237289 -0.336491 -0.361746 -0.499349 -0.235212 -0.234119 -0.222405 0.288512 0.289335 0.262839 0.366094 0.298311 0.262887 0.264698 0.251286 0.319803 0.292947 0.235297 0.228921 0.225013 0.227447 0.279151 0.219617 0.247816 0.233305 0.243593 0.240546 0.233259 0.236209
chargesum: 0.00000
title: Mulliken charges with hydrogens summed into heavy atoms:
elementType: S O O O O N N C C C C C C C C C C C C C C C C C C C C
charge: 0.160120 -0.272212 -0.218552 -0.274915 -0.330527 0.020831 -0.051168 0.147920 -0.146661 -0.284582 0.259949 0.251314 -0.006580 0.469564 -0.095899 -0.152234 0.212391 0.281237 -0.005284 0.000954 -0.009841 -0.057341 -0.142129 0.225365 0.005334 -0.000860 0.013804
polarizability: 3.10299552e+02 -2.55920463e+01 2.94510117e+02 -3.25488926e+00 2.29930904e+00 1.82197292e+02
1716.lowfreq: -8.9467 -4.2597 -0.0012 0.0007 0.0008 4.3475 9.6457 20.1783 22.6278
frequency: 8.1020 20.1428 22.6087 34.3393 37.7692 43.7843 47.0124 53.3034 61.1027 71.5983 81.9316 92.1720 97.6895 104.2120 123.3954 149.3182 157.5288 165.6034 205.2357 223.7849 253.9820 255.4218 265.1166 311.7143 327.6351 332.4945 347.8989 401.7911 406.5629 411.2149 417.1196 466.6611 471.0680 487.7969 500.0957 552.9175 554.6542 570.9242 610.9504 614.3558 616.8905 626.3070 648.8870 655.3593 685.6779 701.5807 708.0394 728.4768 745.2115 753.9590 776.2796 790.4546 793.1239 801.0924 811.8496 854.6355 863.1455 895.6914 904.7070 932.1416 935.8305 939.5680 945.1232 980.1609 984.2510 986.9877 989.2588 990.2305 1004.1445 1008.5937 1010.0992 1023.6448 1027.6041 1034.7977 1074.0671 1088.1466 1114.7640 1119.1671 1131.8691 1139.5078 1148.4523 1150.9854 1172.4416 1175.8084 1191.3782 1193.8378 1213.2308 1217.9205 1221.4952 1233.0859 1252.0847 1269.2430 1287.0372 1300.2731 1318.8846 1322.0008 1331.8339 1341.0429 1384.7066 1385.2138 1419.0363 1425.3873 1429.0235 1438.1758 1442.0122 1453.1982 1458.9418 1464.1101 1471.9104 1484.4591 1493.7926 1501.8790 1552.5196 1592.1035 1596.2322 1610.7918 1612.9251 1625.2567 1654.9285 2982.4135 3007.1303 3022.4963 3029.1274 3042.6910 3104.7740 3110.9768 3113.8881 3119.6018 3121.0210 3123.5333 3125.6691 3135.4739 3136.8185 3146.9730 3148.8002 3152.0600 3161.0284 3162.5221 3172.2864 3426.8470 3565.6837
redmass: 5.2785 5.5588 5.1729 4.2923 5.7526 7.5904 4.9637 4.5272 6.7222 4.7991 5.6984 3.8000 4.7924 1.3367 5.6440 5.5297 4.9702 4.6551 7.6264 3.6164 4.9627 4.9508 5.2887 3.9827 2.6225 3.5194 3.4505 2.8607 2.8813 4.8401 4.5406 3.2083 3.9579 5.8370 4.2075 2.8239 1.8250 3.6093 4.6535 6.1370 6.3355 5.6497 4.4486 5.2527 4.8440 1.5447 1.7178 4.1422 1.3070 5.4874 2.0532 3.0478 2.5804 3.8278 4.1782 1.2511 1.2500 2.4233 1.5101 5.2905 1.5013 1.4792 4.5775 2.7062 1.5222 1.6215 5.0016 3.1128 1.3712 3.3286 1.3366 2.5525 2.2149 2.3060 1.5144 1.5872 1.2682 1.8708 1.1801 4.0729 2.9182 1.4609 1.0521 1.0551 1.1294 1.1319 1.4840 1.5193 2.6052 1.3723 1.2717 1.6706 1.9788 1.2982 1.3390 1.4720 1.2647 1.3175 8.4436 8.7995 1.1143 1.1436 1.6259 1.4226 2.1828 1.0496 1.1284 1.0506 1.9521 2.2984 1.9668 2.3114 5.6416 6.0367 6.3203 6.0119 5.9498 6.4810 10.2894 1.0802 1.0293 1.0575 1.0610 1.0596 1.1082 1.1048 1.1032 1.0852 1.0874 1.1058 1.0877 1.0875 1.0924 1.0966 1.0921 1.1051 1.0957 1.1016 1.1005 1.0803 1.0780
irintensity: 0.2916 0.1757 0.6208 0.1125 0.9949 3.3168 0.5362 1.1639 2.9144 1.0628 1.7902 2.7266 11.5571 0.4971 1.1945 5.0198 6.8823 5.3660 7.8639 8.9680 3.9033 3.0805 7.1608 11.3927 3.7476 0.6552 18.0435 0.5686 0.1629 2.7321 7.2746 17.7758 8.2011 16.4564 12.8652 28.2302 57.2947 15.5064 14.7559 3.1186 0.7645 6.9926 23.9487 16.8027 12.5998 77.5395 64.4465 24.7636 121.7957 11.2174 24.9361 4.9470 26.1349 1.5020 9.6784 0.6131 1.6449 18.3687 2.5506 13.9911 2.0742 7.9459 4.3254 7.8633 1.8919 0.9149 0.2617 0.2703 0.7846 30.7423 0.6161 12.0205 8.9975 5.7575 7.2882 8.7073 0.0313 10.3730 28.5834 285.8647 18.5050 0.3370 0.0319 0.1457 1.9163 3.3328 8.2860 3.1097 1.6941 36.3034 15.3123 5.0926 111.0748 25.2242 3.4580 29.0020 1.1988 19.0898 0.3266 2.7153 2.5179 24.1673 17.0160 16.4295 8.3762 13.6663 5.3308 12.9668 74.9536 23.8464 294.7460 164.7876 115.0704 0.9024 17.9296 9.9116 2.5509 322.9077 149.7998 24.6318 34.3774 16.5802 15.3219 16.8047 1.6305 22.5919 6.2085 3.1523 7.3720 5.5358 3.5193 2.4772 15.2402 27.1170 19.6646 15.1916 9.8497 33.3781 19.0388 114.7658 24.0831
temp: 298.150 k
press: 1.00000 atm
elementType: 16 8 8 8 8 7 7 6 6 6 6 6 6 6 6 6 6 6 6 6 6 6 6 6 6 6 6 1 1 1 1 1 1 1 1 1 1 1 1 1 1 1 1 1 1 1 1 1 1
symmnumber: 1
zpe: 1011632.8 jmol-1
zpe.correction: 0.385311 hartree
zpe.thermalcorrener: 0.412262 hartree
zpe.thermalcorrenthalpy: 0.413206 hartree
zpe.thermalcorrgfe: 0.322182 hartree
zpe.sumelectzpe: -1581.849077 hartree
zpe.sumelectthermal: -1581.822125 hartree
zpe.sumelectthermalent: -1581.821181 hartree
zpe.sumelectthermalfe: -1581.912205 hartree
dipole: -3.9813 -0.4519 -1.8631
dipole: 4.4188
quadrupole: -138.3950 -158.4514 -166.6072
quadrupole: 16.1053 0.9742 -3.8721
quadrupole: 16.0895 -3.9669 -12.1226 16.1053 0.9742 -3.8721
hfenergy: -1582.2343872 hartree
pointgroup: C01 [X(C20H22N2O4S1)]
dipole: 1.156327 1.021047 0.8017277 debye
polarizability: 275.6090025|2.921432|328.2954272|-3.4611812|11.2642437|183.1025312 unknown
InChI: InChI=1S/C20H22N2O4S/c1-26-20(25)17(14-27-13-15-8-4-2-5-9-15)22-18(23)12-21-19(24)16-10-6-3-7-11-16/h2-11,17,21-22H,12-14H2,1H3
charge 0 multiplicity 1
49 atoms
S  -2.810213 -0.598766 0.756891
O  -3.486328 -4.083876 0.141151
O  -2.211509 -3.651742 -1.760263
O  1.211009 -4.299632 0.151848
O  0.946965 0.122251 -1.106033
N  -0.199644 -2.468699 -0.199418
N  2.693586 -1.330219 -0.666667
C  -1.332778 -3.065444 0.500955
C  -1.983131 -2.122408 1.536135
C  -1.524416 0.758602 1.215662
C  -2.357601 -3.60479 -0.522831
C  0.975606 -3.16924 -0.37653
C  2.007867 -2.472489 -1.293705
C  -1.965109 2.078222 0.629983
C  -1.531265 2.467913 -0.665606
C  -2.826137 2.940906 1.357056
C  2.132562 -0.067841 -0.657309
C  2.964583 1.051642 -0.098888
C  -1.949939 3.699644 -1.216765
C  -3.243594 4.172579 0.805589
C  -2.805934 4.555482 -0.484166
C  2.298471 2.238484 0.302823
C  4.378747 0.975782 0.018313
C  -4.54893 -4.649533 -0.727078
C  3.028967 3.320258 0.83553
C  5.10851 2.060734 0.549725
C  4.43513 3.233112 0.965688
H  -0.933119 -3.950852 1.038708
H  -2.776127 -2.658925 2.078116
H  -1.221042 -1.76952 2.250809
H  -0.315977 -1.570232 -0.689374
H  -0.556596 0.437094 0.801242
H  -1.482566 0.789084 2.317318
H  1.502119 -2.109017 -2.205567
H  2.757881 -3.230873 -1.566641
H  3.558062 -1.506889 -0.154291
H  -0.868946 1.800768 -1.230023
H  -3.171957 2.641081 2.353878
H  -1.609203 3.990579 -2.216926
H  -3.908039 4.830524 1.377213
H  -3.129995 5.510193 -0.914002
H  1.212285 2.300858 0.183664
H  4.926247 0.095327 -0.339379
H  -4.918343 -3.877101 -1.421746
H  -5.337405 -4.970647 -0.032563
H  -4.152629 -5.50116 -1.304879
H  2.50338 4.229542 1.145769
H  6.19915 1.997334 0.628437
H  5.002946 4.074601 1.37755
