program: Gaussian 09
title: 000294395
version: EM64L-G09RevD.01
frameworkgroup: C1[X(C22H23NO10S)]
method: RPBEPBE
basis: SDD
operation: Freq
keyword: #p
keyword: freq=noraman
keyword: PBEPBE/SDD
title: #p freq=noraman PBEPBE/SDD
converged: YES YES NO NO
title: Mulliken charges:
elementType: S O O O O O O O O O O N C C C C C C C C C C C C C C C C C C C C C C H H H H H H H H H H H H H H H H H H H H H H H
charge: 0.977658 -0.250287 -0.291319 -0.287628 -0.398759 -0.291232 -0.495276 -0.509344 -0.277263 -0.198591 -0.197302 0.027548 -0.134248 -0.190146 -0.076591 -0.084854 0.354947 -0.282130 -0.315626 -0.699666 -0.677934 0.228148 -0.063538 0.219469 -0.148535 -0.228807 -0.325595 -0.332917 -0.347943 -0.335994 0.389331 -0.218909 -0.216518 -0.218759 0.258582 0.255583 0.261428 0.242763 0.254211 0.248289 0.263282 0.258066 0.254127 0.223665 0.225902 0.225750 0.235386 0.227772 0.346265 0.298249 0.252079 0.266472 0.294606 0.297676 0.239862 0.232968 0.235628
chargesum: 0.00000
title: Mulliken charges with hydrogens summed into heavy atoms:
elementType: S O O O O O O O O O O N C C C C C C C C C C C C C C C C C C C C C C
charge: 0.977658 -0.250287 -0.291319 -0.287628 -0.398759 -0.291232 -0.495276 -0.509344 -0.277263 -0.198591 -0.197302 0.027548 0.124335 0.065437 0.184837 0.157910 0.354947 0.220369 0.205722 0.004028 0.010973 0.228148 -0.063538 0.219469 0.197731 0.069442 -0.073517 -0.066445 -0.053337 -0.038318 0.389331 0.020953 0.016450 0.016870
polarizability: 4.14469817e+02 -1.37893036e+01 3.39318779e+02 -1.22320059e+01 1.19029948e+01 1.87287493e+02
1716.lowfreq: -6.0242 -3.5625 -0.0016 -0.0013 0.0007 4.3420 4.6325 15.1848 16.9518
frequency: 2.9740 14.4102 16.6147 26.3815 30.1594 37.8048 44.6224 48.4066 55.2512 72.0568 73.2125 87.2094 89.2916 104.0251 120.5397 128.1196 134.1274 141.3933 164.5238 179.5978 182.1797 201.3996 219.4281 225.2069 226.1506 257.7298 258.6735 283.4754 290.5392 306.5905 325.7908 336.0380 350.2174 366.6520 378.0305 388.7651 402.3508 404.9540 412.4908 427.8787 440.6730 458.7294 466.5708 479.5653 494.7841 496.5146 504.4111 512.8234 555.7374 581.6875 610.7462 614.3446 642.6183 657.5082 664.7748 677.3326 683.0465 699.5920 722.4153 729.9006 734.8820 749.2524 774.1200 780.3230 784.2433 795.7796 802.3665 829.4444 845.5581 859.0003 862.5986 864.3707 884.9592 896.8961 923.7715 926.2332 939.7732 950.7512 953.6495 957.1551 984.8963 988.7813 991.0843 994.4142 996.3987 1001.0409 1004.6391 1009.2677 1016.3915 1019.4136 1022.9871 1039.6348 1043.5173 1057.4231 1063.8682 1084.6853 1089.0691 1104.8064 1110.1178 1121.3448 1138.9418 1174.4232 1175.8767 1181.8831 1192.7603 1201.9076 1209.2854 1218.8433 1231.9722 1244.5432 1245.7710 1261.2124 1270.0837 1282.4300 1286.5626 1303.2955 1313.7613 1314.2765 1321.1756 1335.3297 1356.0678 1365.7515 1369.6592 1385.3805 1390.2311 1391.1496 1399.6292 1424.7129 1438.3710 1439.7890 1450.5094 1451.5747 1456.4496 1469.3041 1476.8229 1477.6697 1479.3354 1577.3831 1584.6119 1605.8715 1611.2106 1620.0300 2997.0883 2998.0206 3011.1192 3011.4942 3030.2293 3045.2135 3052.1422 3066.0631 3078.3910 3098.3196 3103.3143 3111.6129 3121.6159 3124.6771 3133.3172 3145.3857 3156.9299 3159.0991 3164.8349 3169.6825 3181.1997 3190.7077 3197.3702
redmass: 7.7682 8.3482 8.1276 5.2106 5.7777 5.1490 5.6813 6.5029 8.5636 6.0836 5.3190 6.5727 5.0644 6.5154 6.2997 6.5459 5.0993 5.2556 1.0456 5.1517 4.7320 9.7613 8.7786 2.4459 1.5970 5.6546 9.0320 4.3532 5.3665 3.7910 3.2379 3.7425 6.9093 4.9438 4.8658 4.8555 2.8113 4.6994 2.9308 5.8314 3.7941 4.3162 3.6786 4.1306 4.1754 5.9838 7.4523 8.8159 7.8924 4.8350 7.1187 6.4493 5.4901 6.4485 5.3522 5.1096 8.7187 1.6008 6.2228 4.9279 4.2118 3.9820 5.6831 4.3296 9.5343 2.1637 4.6744 16.0929 3.7095 1.2759 1.2940 3.7598 1.4591 3.7710 2.0403 2.6724 4.0807 2.4110 1.4280 16.7096 1.3911 4.7821 5.3929 1.4602 1.3503 2.4835 2.7345 1.3354 1.3824 3.9020 2.8182 3.4649 2.2673 2.7207 2.8231 3.3585 2.0213 2.6581 1.3216 2.1547 2.0503 1.1767 1.1226 1.1351 1.6334 2.2947 1.2068 7.8673 1.1656 3.0278 1.5635 1.6977 1.8842 1.3451 1.2566 1.2129 1.3177 1.2594 1.3084 1.2552 1.2950 1.4382 6.1026 1.2754 5.7855 10.1065 1.2296 6.7902 1.9993 1.1641 2.0750 1.0558 1.0475 1.0698 1.0627 2.2808 1.0593 6.2939 6.7489 8.2921 6.1740 9.7354 1.0549 1.0369 1.0684 1.0512 1.0862 1.0583 1.0871 1.0950 1.1008 1.1000 1.1000 1.0995 1.1083 1.1003 1.0857 1.0889 1.0938 1.0938 1.0909 1.0980 1.0976 1.0955 1.0944
irintensity: 0.0505 0.3029 0.1819 0.0931 0.4539 0.0313 0.3076 1.2198 1.7947 1.4031 0.6704 0.3659 0.8211 6.0579 5.4379 4.7200 1.4241 6.8819 0.2930 5.2798 2.3515 11.1476 3.2797 2.7037 3.2744 0.6592 2.8790 12.7286 0.3166 13.1635 15.3416 0.9906 15.7449 9.0252 20.5818 0.4993 0.0393 22.8539 0.3164 5.9218 1.5338 12.5940 5.7291 9.1816 9.1245 5.7324 3.4306 40.4446 92.0519 22.8075 2.9313 0.7020 2.7298 5.9060 20.7883 17.4695 35.9934 89.4009 22.7770 6.8362 4.9011 3.0886 10.3412 39.3597 32.3790 23.5896 5.1960 84.0012 51.2838 6.6645 1.6038 24.5511 47.1831 27.3611 7.5380 1.3395 41.1611 3.4281 2.9347 88.2037 12.5573 5.7869 1.9790 0.0760 0.9124 41.6043 15.7426 0.2192 2.7475 176.2909 21.1850 73.0007 16.4242 29.2845 197.0936 11.7131 22.9445 12.6921 27.5105 34.1597 28.0133 9.9694 5.2301 46.3142 75.9137 102.9910 21.8874 228.9607 10.3655 269.9198 55.5619 18.2458 4.6916 26.7616 5.4818 4.5041 1.6263 1.3876 11.9577 0.9944 6.1110 20.5793 38.1721 41.2983 120.5221 3.2117 34.3087 56.2381 15.1452 15.2080 9.8301 7.3566 3.6795 10.5207 11.1961 5.2983 11.7144 27.6009 54.4542 0.1793 15.2473 232.3846 34.8869 3.9591 6.3361 11.6646 40.0933 21.4181 15.1898 24.8844 27.6764 26.0295 3.0040 20.7923 5.1957 19.0692 0.6251 5.9363 22.7493 105.7310 5.8225 18.8116 7.6884 2.4000 6.7925
temp: 298.150 k
press: 1.00000 atm
elementType: 16 8 8 8 8 8 8 8 8 8 8 7 6 6 6 6 6 6 6 6 6 6 6 6 6 6 6 6 6 6 6 6 6 6 1 1 1 1 1 1 1 1 1 1 1 1 1 1 1 1 1 1 1 1 1 1 1
symmnumber: 1
zpe: 1111579.8 jmol-1
zpe.correction: 0.423378 hartree
zpe.thermalcorrener: 0.456017 hartree
zpe.thermalcorrenthalpy: 0.456961 hartree
zpe.thermalcorrgfe: 0.352957 hartree
zpe.sumelectzpe: -2054.398295 hartree
zpe.sumelectthermal: -2054.365656 hartree
zpe.sumelectthermalent: -2054.364712 hartree
zpe.sumelectthermalfe: -2054.468716 hartree
dipole: 5.4059 5.7272 1.5337
dipole: 8.0235
quadrupole: -199.6670 -194.2740 -210.1778
quadrupole: 1.8532 7.2761 1.5171
quadrupole: 1.7059 7.0990 -8.8049 1.8532 7.2761 1.5171
hfenergy: -2054.821673 hartree
pointgroup: C01[X(C22H23N1O10S1)]
dipole: 2.8804177 -0.4480805 -1.2112633 debye
polarizability: 383.2677037|43.7434321|328.2846162|2.6243008|76.7304767|229.5237694 unknown
InChI: InChI=1S/C22H23NO10S/c1-22(2)32-19-17(12-29-21(24)14-6-4-3-5-7-14)31-18(20(19)33-22)13-30-34(27,28)16-10-8-15(9-11-16)23(25)26/h3-11,17-20H,12-13H2,1-2H3
charge 0 multiplicity 1
57 atoms
S  -1.365887 2.356504 2.208754
O  1.399509 1.015728 -1.118976
O  3.644375 3.428816 0.468497
O  3.995558 1.16532 1.029208
O  -0.47407 2.590253 0.570238
O  1.825096 -2.092972 -0.462164
O  -1.944742 3.766128 2.752479
O  -0.395166 1.45233 3.144904
O  -0.255404 -1.970452 0.592458
O  -5.815565 -2.176445 -0.234531
O  -7.196284 -0.378972 0.01797
N  -6.042818 -0.950775 0.096116
C  3.141505 2.61547 -0.649175
C  3.723939 1.18823 -0.424878
C  1.591224 2.404691 -0.647361
C  2.607092 0.198223 -0.808921
C  4.437502 2.533609 1.385956
C  0.989186 2.670331 0.74278
C  2.318411 -0.881966 0.247964
C  4.041485 2.80965 2.831012
C  5.932643 2.734244 1.097267
C  0.522231 -2.532082 -0.219273
C  -2.79547 1.337507 1.535791
C  0.182504 -3.737669 -1.028093
C  -2.537329 0.009503 1.163474
C  -4.051383 1.962654 1.459618
C  -1.097966 -4.323893 -0.848761
C  1.093324 -4.300661 -1.959968
C  -3.625595 -0.74875 0.683017
C  -5.134503 1.197819 0.981314
C  -4.898022 -0.142164 0.602232
C  -1.466368 -5.460322 -1.596256
C  0.720416 -5.437963 -2.706133
C  -0.557857 -6.018805 -2.527052
H  3.470676 3.071057 -1.597625
H  4.656716 1.007907 -0.989342
H  1.081145 3.040295 -1.390172
H  2.868199 -0.314688 -1.752953
H  1.281736 3.679289 1.084372
H  1.33221 1.914526 1.474106
H  1.567151 -0.546622 0.98119
H  3.240823 -1.191672 0.763882
H  2.967966 2.619275 2.985389
H  4.616921 2.159316 3.511437
H  4.258143 3.861521 3.082027
H  6.170707 2.515845 0.041896
H  6.21184 3.782172 1.299445
H  6.537136 2.073249 1.741966
H  -1.542075 -0.441024 1.226471
H  -4.173531 3.004314 1.771803
H  -1.784324 -3.880487 -0.120052
H  2.077713 -3.843021 -2.088728
H  -3.491585 -1.786337 0.369928
H  -6.140621 1.615372 0.896873
H  -2.45549 -5.908853 -1.456564
H  1.422306 -5.872031 -3.426248
H  -0.844729 -6.901622 -3.109208
