program: Gaussian 09
title: 000022582
version: EM64L-G09RevD.01
frameworkgroup: C1[X(C7H7NO5S)]
method: RPBEPBE
basis: SDD
operation: Freq
keyword: #p
keyword: freq=noraman
keyword: PBEPBE/SDD
title: #p freq=noraman PBEPBE/SDD
converged: NO NO NO NO
title: Mulliken charges:
elementType: S O O O O O N C C C C C C C H H H H H H H
charge: 0.992964 -0.394759 -0.497909 -0.498031 -0.190722 -0.190725 0.028696 -0.056510 -0.198048 -0.197614 0.397294 -0.325378 -0.325402 -0.480968 0.294320 0.294236 0.301117 0.301121 0.246747 0.246684 0.252890
chargesum: 0.00000
title: Mulliken charges with hydrogens summed into heavy atoms:
elementType: S O O O O O N C C C C C C C
charge: 0.992964 -0.394759 -0.497909 -0.498031 -0.190722 -0.190725 0.028696 -0.056510 0.096272 0.096621 0.397294 -0.024260 -0.024281 0.265352
polarizability: 1.88267826e+02 -6.89641129e-03 1.25784141e+02 -6.43480457e-01 4.74914413e-02 7.72042739e+01
1716.lowfreq: -11.8230 -5.5323 -4.7942 -0.0021 -0.0021 -0.0010 19.4665 41.7443 49.4688
frequency: 18.5872 41.5341 49.4596 63.2180 108.3879 116.0021 117.1011 198.0756 212.8184 213.4368 270.3354 293.2890 349.0509 364.2356 409.1177 411.4572 466.7819 505.0407 505.5099 540.1310 611.3626 660.6592 682.7648 735.6842 783.8939 830.6983 853.1706 870.5765 915.6768 956.7461 992.6802 993.1923 1002.0854 1047.6868 1087.5392 1105.1748 1108.4631 1109.4808 1171.3069 1219.8833 1282.2513 1376.1273 1391.3688 1408.0527 1427.6898 1440.4196 1451.6995 1471.5162 1580.9017 1610.5682 2984.3295 3094.1141 3115.9271 3169.0015 3169.1895 3192.0217 3194.0968
redmass: 4.1811 5.1863 6.0136 5.7497 1.3580 3.5663 6.5774 10.0077 5.7179 9.9838 7.3767 6.6681 10.4123 8.6779 8.2192 2.8695 5.0006 7.1508 7.3212 9.3801 7.1005 4.9414 8.6032 4.2573 9.5587 15.3731 1.2373 1.5556 9.0362 18.1197 2.3730 2.0094 1.3782 2.2543 4.2731 1.2841 1.3452 1.2560 1.2156 9.5539 1.2443 5.3024 6.8841 1.1202 6.8719 1.0546 2.1609 1.0560 6.2327 8.4543 1.0280 1.1065 1.1031 1.0909 1.0912 1.0953 1.0966
irintensity: 2.3716 2.0432 1.0671 0.0403 1.9591 6.0532 9.6671 9.5583 5.4246 3.7478 4.9411 1.4662 9.5310 3.7578 29.4636 0.0015 6.2273 41.2677 0.7725 146.4883 0.0865 26.6155 37.3596 6.2459 36.4003 85.6349 0.4166 45.4571 85.9766 83.8616 5.9957 2.2850 0.0114 28.9062 3.4098 9.4088 13.6831 0.0580 7.8210 228.7659 0.0646 32.6283 82.1942 0.7795 53.9139 13.6579 8.6313 25.2005 13.9930 0.3109 35.9001 20.3831 9.6249 1.1734 8.0719 4.7932 1.2816
temp: 298.150 k
press: 1.00000 atm
elementType: 16 8 8 8 8 8 7 6 6 6 6 6 6 6 1 1 1 1 1 1 1
symmnumber: 1
zpe: 360982.6 jmol-1
zpe.correction: 0.137491 hartree
zpe.thermalcorrener: 0.151790 hartree
zpe.thermalcorrenthalpy: 0.152734 hartree
zpe.thermalcorrgfe: 0.093671 hartree
zpe.sumelectzpe: -1098.561908 hartree
zpe.sumelectthermal: -1098.547610 hartree
zpe.sumelectthermalent: -1098.546665 hartree
zpe.sumelectthermalfe: -1098.605728 hartree
dipole: 1.9801 -0.0057 2.1140
dipole: 2.8965
quadrupole: -106.5803 -87.0707 -90.7889
quadrupole: -0.0401 13.8399 -0.0026
quadrupole: -11.7670 7.7426 4.0244 -0.0401 13.8399 -0.0026
hfenergy: -1098.6993993 hartree
pointgroup: C01 [X(C7H7N1O5S1)]
dipole: 0.7999674 0.0014661 0.8115965 debye
dipolederiv: 1.9979867 -0.0003373 -0.0110207 0.0002589 1.1810379 0.0012845 0.2683537 0.0013256 1.5638267 -0.9546223 -0.0006278 -0.1615063 -0.0008335 -0.4281278 -0.0009412 -0.3213672 -0.000873 -0.698361 -0.6857265 0.0307878 0.0363246 0.0211808 -0.5663531 -0.1433303 -0.0366629 -0.040216 -0.54273 -0.6856756 -0.030588 0.0366088 -0.0211472 -0.5657068 0.1432919 -0.036604 0.0401855 -0.5434958 -0.7119328 0.1863675 0.0521025 0.1268726 -0.6438048 -0.0118414 0.0651734 -0.0233369 -0.221777 -0.7121136 -0.1858544 0.0535643 -0.1262923 -0.6433139 0.0151097 0.0661781 0.0265873 -0.2220754 1.7032968 -0.0009071 -0.1697421 -0.0009788 1.0855032 -0.0033691 -0.1974692 -0.0033521 0.2121882 0.0972353 -0.0000643 0.0022391 0.0002308 0.011504 -0.0007424 0.0819413 -0.0008761 -0.1728008 -0.3117029 0.2176649 0.0063509 -0.1112817 -0.0320633 0.0065828 0.0167806 -0.0439612 -0.0710571 -0.3115146 -0.217372 0.0080283 0.1112538 -0.0315128 -0.0069403 0.0161222 0.0437518 -0.0712072 -0.4731679 0.0004306 0.0580663 0.0003871 0.0998537 -0.0001415 0.0702568 -0.0001572 0.0660226 0.0365895 -0.1847014 -0.0177594 0.1999374 -0.0505022 -0.0191717 -0.0306458 0.0251858 -0.0772842 0.0364834 0.1845307 -0.0191801 -0.2001877 -0.0505624 0.019 -0.0289467 -0.0253675 -0.077203 0.6479774 0.001105 0.249511 0.0009023 0.2430539 0.0004353 -0.1393538 -0.0001893 0.0530118 0.1181218 -0.0521495 0.015906 -0.0327367 0.0880805 -0.0016911 0.0079489 0.014831 0.1491832 0.1178781 0.0521825 0.0155032 0.0329098 0.0877861 0.0021774 0.0076213 -0.0143933 0.1492012 0.0899084 0.0474965 0.0092824 0.0091032 0.085984 -0.0008644 0.0175408 -0.0051295 0.1740581 0.0898772 -0.0474265 0.0096414 -0.0089637 0.0860868 0.0015322 0.0175858 0.0057945 0.173995 -0.0384301 -0.0366425 -0.0494436 -0.0951753 -0.0501306 0.0530991 0.0833105 0.0816969 0.101567 -0.0382781 0.0363574 -0.0490408 0.0948821 -0.0495518 -0.0536285 0.0840993 -0.0817462 0.10164 -0.0121901 -0.000252 -0.0754357 -0.0003221 0.1427396 0.0001492 -0.011863 0.0002399 -0.0467023 unknown
polarizability: 188.1629704|-0.0512244|125.7834303|-3.4706123|-0.1942676|77.3098407 unknown
InChI: InChI=1S/C7H7NO5S/c1-13-14(11,12)7-4-2-6(3-5-7)8(9)10/h2-5H,1H3
charge 0 multiplicity 1
21 atoms
S  2.534689 -0.002376 -0.57711
O  2.978616 0.000403 1.22683
O  2.988959 -1.41257 -1.235429
O  2.99055 1.405108 -1.240295
O  -4.11448 1.143156 0.324379
O  -4.115117 -1.136977 0.333299
N  -3.520918 0.002617 0.250283
C  0.671381 -0.000819 -0.300473
C  0.024301 1.242116 -0.221478
C  0.023507 -1.242688 -0.211821
C  -2.041948 0.001422 0.05626
C  -1.374496 1.241266 -0.040063
C  -1.375285 -1.23958 -0.030402
C  4.443127 0.001516 1.450365
H  0.589463 2.173749 -0.316568
H  0.587957 -2.175461 -0.299601
H  -1.944829 2.170559 0.028512
H  -1.946183 -2.167962 0.045325
H  4.908194 0.912211 1.033613
H  4.910019 -0.907289 1.031456
H  4.535793 0.0002 2.548319
