program: Gaussian 09
title: 000293763
version: EM64L-G09RevD.01
frameworkgroup: C1[X(C11H13Cl2N5)]
method: RPBEPBE
basis: SDD
operation: Freq
keyword: #p
keyword: freq=noraman
keyword: PBEPBE/SDD
title: #p freq=noraman PBEPBE/SDD
converged: YES YES NO NO
title: Mulliken charges:
elementType: Cl Cl N N N N N C C C C C C C C C C C H H H H H H H H H H H H H
charge: -0.002720 -0.045091 -0.312163 -0.088163 -0.166553 -0.627181 -0.612970 0.192503 -0.680408 -0.714016 0.479810 0.244416 -0.012096 -0.321774 -0.267403 -0.114853 -0.205957 -0.235482 0.238446 0.234308 0.202728 0.242128 0.243479 0.205812 0.281516 0.337421 0.337774 0.262526 0.264356 0.317711 0.321896
chargesum: 0.00000
title: Mulliken charges with hydrogens summed into heavy atoms:
elementType: Cl Cl N N N N N C C C C C C C C C C C
charge: -0.002720 -0.045091 -0.312163 -0.088163 -0.166553 0.048015 0.026637 0.192503 -0.004927 -0.022598 0.479810 0.244416 -0.012096 -0.321774 0.014113 -0.114853 0.056569 0.028874
polarizability: 2.63263127e+02 7.56173208e+00 1.56927649e+02 3.44154592e-01 -5.16012076e-03 1.25692821e+02
1716.lowfreq: -10.7742 -2.8799 -0.0020 -0.0014 0.0006 3.6214 22.1628 40.3299 75.4995
frequency: 22.0542 40.3116 75.4963 81.4113 91.8066 122.0442 156.7521 189.1938 208.3982 228.9530 239.3060 264.0420 272.0779 301.2606 309.1932 311.7271 323.2041 349.9533 363.9045 381.8979 385.4845 447.4200 457.2378 486.9595 496.2206 515.3009 517.7327 528.2618 541.6777 564.6528 583.2621 618.8034 663.0991 673.2154 709.1241 724.8522 762.8649 807.0795 810.8764 860.5768 884.8995 911.6359 943.0422 946.5305 952.7293 990.0320 1025.1483 1052.2740 1075.0723 1106.1444 1121.0706 1129.4420 1133.7081 1192.6541 1239.5636 1243.2936 1269.7388 1345.0479 1368.3167 1377.2208 1387.2621 1405.4494 1438.4037 1447.8466 1452.2663 1462.3093 1470.1027 1478.7377 1539.0989 1551.1952 1571.2872 1581.4921 1612.5905 1620.6816 2981.0759 2999.4761 3080.1228 3094.4592 3102.4421 3112.3058 3163.1788 3177.8226 3182.6582 3554.6319 3567.2660 3708.5281 3729.0679
redmass: 5.2905 6.0557 4.5025 5.8835 10.8514 4.3735 11.1219 5.1192 2.7051 4.9122 1.2438 2.7780 1.2899 2.7400 14.4647 3.7368 3.7789 3.5497 2.8356 1.2572 1.1955 3.9040 3.1504 2.8951 2.1465 1.4227 4.8899 1.6179 2.7765 5.6173 4.6327 5.1972 6.0915 8.3372 4.7136 10.6583 6.5140 3.8192 1.3635 2.8417 1.5451 1.5767 1.4651 1.9327 3.6496 1.3594 6.4210 3.6704 1.8691 1.8980 2.3238 1.9822 1.4541 3.3751 1.4966 3.2942 3.0461 7.3460 1.2251 3.9454 1.2705 4.0086 4.5324 1.6965 1.4522 1.0707 1.0682 1.0588 2.4630 6.0983 1.8398 5.3739 2.7336 2.0797 1.0351 1.0355 1.0999 1.0999 1.1003 1.0998 1.0890 1.0929 1.0976 1.0446 1.0438 1.1052 1.1058
irintensity: 0.4102 0.1513 0.1784 0.9119 0.7724 0.2626 1.3418 4.6024 1.8563 1.3930 0.8143 1.0379 0.5500 5.0956 1.2385 4.2702 0.0023 12.5189 2.0020 33.6009 341.3659 3.7012 15.9650 28.6581 61.0159 31.2104 4.5492 28.5650 27.3039 10.5573 0.6724 6.0915 2.4340 10.0999 1.7709 28.1442 24.8741 77.1759 34.8283 14.0993 5.4990 1.1499 4.8598 16.2182 34.2745 0.8907 61.8317 6.5017 34.2986 5.2438 5.6319 37.9562 13.3965 37.5360 4.8349 28.3207 57.3594 3.4293 36.8064 132.6210 25.0854 331.8685 140.8587 80.2162 84.0876 4.1630 3.8307 23.6057 241.1769 22.1939 186.8657 102.7473 673.9914 367.1725 16.6880 16.4552 25.5949 13.2946 27.9007 18.8651 0.5430 0.2625 0.6721 61.3566 91.2462 44.9428 38.7744
temp: 298.150 k
press: 1.00000 atm
elementType: 17 17 7 7 7 7 7 6 6 6 6 6 6 6 6 6 6 6 1 1 1 1 1 1 1 1 1 1 1 1 1
symmnumber: 1
zpe: 611692.6 jmol-1
zpe.correction: 0.232981 hartree
zpe.thermalcorrener: 0.250941 hartree
zpe.thermalcorrenthalpy: 0.251885 hartree
zpe.thermalcorrgfe: 0.186912 hartree
zpe.sumelectzpe: -1619.537863 hartree
zpe.sumelectthermal: -1619.519904 hartree
zpe.sumelectthermalent: -1619.518960 hartree
zpe.sumelectthermalfe: -1619.583933 hartree
dipole: -1.8903 1.3333 1.5315
dipole: 2.7742
quadrupole: -113.6227 -118.3716 -116.1197
quadrupole: -4.7373 2.4695 2.6490
quadrupole: 2.4153 -2.3336 -0.0817 -4.7373 2.4695 2.6490
hfenergy: -1619.7708448 hartree
pointgroup: C01 [X(C11H13Cl2N5)]
dipole: 0.7981373 0.2628184 -0.6965576 debye
polarizability: 260.9026913|-15.8565058|156.2856316|7.2497823|-9.517878|128.695274 unknown
InChI: InChI=1S/C11H13Cl2N5/c1-11(2)17-9(14)16-10(15)18(11)8-5-6(12)3-4-7(8)13/h3-5H,14-15H2,1-2H3
charge 0 multiplicity 1
31 atoms
Cl 0.162775 2.948526 -0.170463
Cl 4.438905 -1.824933 0.281076
N  -0.504043 -0.081263 -0.093303
N  -2.701336 -0.104387 1.060096
N  -2.532667 -0.102336 -1.388102
N  -0.472954 0.050492 -2.467737
N  -4.572176 0.243439 -0.310602
C  -1.302907 -0.535789 1.162944
C  -1.240796 -2.086219 1.247034
C  -0.686408 0.118042 2.413866
C  0.88496 0.239703 -0.028943
C  -1.201751 -0.049476 -1.301096
C  -3.22038 -0.005383 -0.156649
C  1.351655 1.585249 -0.04913
C  1.85745 -0.7950 0.066483
C  3.222695 -0.473488 0.154693
C  2.723178 1.895598 0.029026
C  3.678074 0.859377 0.138052
H  -1.871677 -2.422602 2.087915
H  -1.634793 -2.537594 0.319021
H  -0.209732 -2.446108 1.419965
H  -0.716896 1.216702 2.324335
H  -1.305423 -0.169647 3.279181
H  0.351147 -0.213502 2.5930
H  1.523521 -1.835691 0.062579
H  -1.000491 0.164091 -3.329516
H  0.540772 -0.017179 -2.483876
H  3.047565 2.939906 0.014456
H  4.744302 1.090377 0.208065
H  -5.156483 0.331771 0.515433
H  -4.937189 0.408121 -1.243604
