program: Gaussian 09
title: 000293717
version: EM64L-G09RevD.01
frameworkgroup: C1[X(C6H10S)]
method: RPBEPBE
basis: SDD
operation: Freq
keyword: #pfreq=noraman
keyword: PBEPBE/SDD
title: #p freq=noraman PBEPBE/SDD
converged: YES YES NO NO
title: Mulliken charges:
elementType: S C C C C C C H H H H H H H H H H
charge: 0.125585 -0.448258 -0.448259 -0.145838 -0.145837 -0.634511 -0.634510 0.261135 0.261135 0.234110 0.234109 0.234495 0.205937 0.230138 0.205936 0.234495 0.230138
chargesum: 0.00000
title: Mulliken charges with hydrogens summed into heavy atoms:
elementType: S C C C C C C
charge: 0.125585 -0.187123 -0.187124 0.088271 0.088272 0.036059 0.036059
polarizability: 1.02269033e+02 -7.94541689e-06 7.48161082e+01 -2.60615988e-05 1.24376969e+00 5.49515459e+01
1716.lowfreq: -17.4116 -12.0264 -0.0026 -0.0022 0.0027 13.0110 54.7321 198.8785 225.5660
frequency: 54.7270 198.8720 225.5606 232.9356 270.6069 301.7284 357.0668 496.5328 530.3434 567.7021 603.1272 740.5286 747.0418 868.6386 912.8237 948.2959 991.2665 997.0412 1055.8512 1074.9357 1075.9510 1084.4195 1130.7850 1198.3227 1233.3311 1285.6907 1295.6179 1335.4659 1383.4906 1383.7139 1461.1988 1463.1103 1469.9001 1471.8435 1657.3791 2975.2688 2975.8657 3006.8036 3008.2944 3071.0283 3071.5414 3099.8502 3100.6187 3109.1904 3141.9288
redmass: 3.3754 1.9359 1.0540 1.2295 2.8466 2.9488 3.0109 5.7875 3.1988 4.7080 3.5046 3.5938 1.3023 2.4469 1.8268 1.2604 1.3613 1.6093 2.1790 1.5075 2.6469 1.4068 1.1691 1.4143 1.4193 1.2550 1.4417 1.7385 1.1978 1.2050 1.0499 1.0466 1.0457 1.0461 7.4927 1.0371 1.0371 1.0842 1.0845 1.0968 1.0966 1.1009 1.1010 1.0844 1.1037
irintensity: 1.5302 0.0008 0.2748 0.1350 1.7640 2.8073 0.1219 1.8105 3.1940 0.7662 5.8651 0.0159 60.0437 0.5982 13.2387 0.0124 4.7404 11.4441 8.0262 12.2563 0.4566 3.3945 5.0641 17.5571 3.9313 3.0619 0.0907 12.2164 21.5984 3.2228 6.5507 15.3799 5.2050 12.4411 6.2628 55.0344 20.2117 21.7692 18.6021 7.8626 41.8584 26.9341 28.9053 7.1693 28.0196
temp: 298.150 k
press: 1.00000 atm
elementType: 16 6 6 6 6 6 6 1 1 1 1 1 1 1 1 1 1
symmnumber: 1
zpe: 374827.3 jmol-1
zpe.correction: 0.142764 hartree
zpe.thermalcorrener: 0.150677 hartree
zpe.thermalcorrenthalpy: 0.151621 hartree
zpe.thermalcorrgfe: 0.110409 hartree
zpe.sumelectzpe: -632.126219 hartree
zpe.sumelectthermal: -632.118306 hartree
zpe.sumelectthermalent: -632.117362 hartree
zpe.sumelectthermalfe: -632.158574 hartree
dipole: 0.0000 1.9533 0.4203
dipole: 1.9980
quadrupole: -44.3588 -51.6858 -53.0446
quadrupole: 0.0000 0.0000 -0.6395
quadrupole: 5.3376 -1.9894 -3.3482 0.0000 0.0000 -0.6395
hfenergy: -632.2689827 hartree
pointgroup: C01 [X(C6H10S1)]
dipole: 0.0000006 -0.7153107 -0.3259511 debye
dipolederiv: -0.4216235 0.0000091 -0.0000192 0.0000102 -0.1561657 -0.00172 -0.0000188 0.0091465 -0.2193442 0.3320739 0.1417549 0.0801283 0.1914863 0.0852645 -0.019994 0.0826447 -0.0291085 0.2259882 0.3320765 -0.1417682 -0.0801093 -0.191502 0.0852888 -0.020024 -0.0826245 -0.0291285 0.2259572 -0.0442774 -0.1165135 -0.0310364 -0.0808283 0.0470194 0.0866784 -0.0583184 0.1139183 -0.2385772 -0.0442762 0.116498 0.0310799 0.0808194 0.0470062 0.086691 0.0583627 0.1139361 -0.2385597 -0.0123039 0.0370685 -0.0739441 0.0173003 0.0063463 0.003744 -0.011966 0.0276724 -0.0210843 -0.012323 -0.0370721 0.0739458 -0.0173005 0.0063511 0.0037352 0.0119683 0.0276641 -0.0210682 -0.0806442 -0.0386555 0.0786299 -0.0188386 0.0160095 0.0309776 0.0766699 0.0154616 -0.0714598 -0.0806104 0.0386603 -0.0786294 0.0188409 0.0160055 0.0309872 -0.0766707 0.0154749 -0.0714896 0.0371728 -0.0795465 -0.018434 -0.0872848 -0.07063 -0.0660686 -0.030878 -0.0860977 0.1573184 0.0371759 0.0795551 0.0184059 0.0872892 -0.0706438 -0.0660533 0.0308487 -0.086085 0.1573274 0.0376709 -0.0191835 0.1273044 -0.0004996 0.0912627 0.0211092 0.0562296 0.0290771 -0.0700585 -0.0892608 -0.112346 -0.0721323 -0.1574719 -0.017331 -0.0262923 -0.0814703 -0.0157522 0.0629365 0.0303633 0.0826228 0.0012695 0.1415802 -0.0798546 -0.0292974 0.0168632 -0.0597563 0.0646223 -0.0892689 0.1123548 0.0721017 0.1574829 -0.0173523 -0.0262684 0.0814404 -0.0157374 0.0629653 0.0377061 0.019182 -0.1272832 0.0004998 0.0912611 0.0211185 -0.0562074 0.0290845 -0.0700932 0.0303488 -0.0826202 -0.0012777 -0.1415834 -0.0798377 -0.0293233 -0.0168733 -0.0597697 0.0646195 unknown
polarizability: 102.2690321|-0.001656|73.3870126|0.0045813|5.2813832|56.3806421 unknown
InChI: InChI=1S/C6H10S/c1-5-3-4-6(2)7-5/h3-6H,1-2H3
charge 0 multiplicity 1
17 atoms
S  0.000021 1.301145 0.751077
C  -1.402502 0.053718 0.347138
C  1.402521 0.053609 0.347405
C  -0.677382 -1.230165 -0.003688
C  0.677368 -1.230218 -0.003557
C  -2.318815 0.572418 -0.780976
C  2.319086 0.572233 -0.780539
H  -1.985871 -0.067306 1.279432
H  1.985706 -0.06746 1.279809
H  -1.271962 -2.114304 -0.268298
H  1.27193 -2.114405 -0.268053
H  -1.74002 0.724263 -1.707895
H  -3.129739 -0.154462 -0.984082
H  -2.784404 1.533523 -0.500366
H  3.129992 -0.154711 -0.983493
H  1.740474 0.724119 -1.707567
H  2.784697 1.533303 -0.499847
