program: Gaussian 09
title: 000293722
version: EM64L-G09RevD.01
frameworkgroup: C1[X(C10H19NO)]
method: RPBEPBE
basis: SDD
operation: Freq
keyword: #p
keyword: freq=noraman
keyword: PBEPBE/SDD
title: #p freq=noraman PBEPBE/SDD
converged: YES YES NO NO
title: Mulliken charges:
elementType: O N C C C C C C C C C C H H H H H H H H H H H H H H H H H H H
charge: -0.270473 -0.077473 0.222364 -0.477622 -0.002311 0.138220 -0.717584 -0.720286 -0.142136 -0.720056 -0.699063 -0.690395 0.207353 0.220063 0.216267 0.231699 0.197428 0.220686 0.238466 0.214457 0.204732 0.220322 0.224539 0.209042 0.235963 0.218762 0.231965 0.216826 0.217200 0.231315 0.199731
chargesum: 0.00000
title: Mulliken charges with hydrogens summed into heavy atoms:
elementType: O N C C C C C C C C C C
charge: -0.270473 -0.077473 0.222364 -0.050206 0.213956 0.138220 -0.067771 -0.062632 0.078187 -0.050512 -0.031510 -0.042149
polarizability: 1.30637565e+02 2.70415065e+00 1.23808719e+02 -1.15966447e+00 5.94771938e-01 9.77603315e+01
1716.lowfreq: -7.1845 -0.0009 -0.0008 -0.0006 7.8102 9.5084 34.6119 86.5707 91.7344
frequency: 34.2418 86.5563 91.7338 137.1712 155.6284 188.4073 195.8767 206.8918 222.4324 235.0641 252.0611 267.6514 301.9295 316.0270 341.1092 383.9858 433.5313 448.9786 486.0285 491.7431 516.5683 586.7981 682.0568 772.7303 794.3258 814.1810 867.5155 893.7693 918.7629 922.1795 927.3096 934.1687 960.2796 977.3514 994.6129 1035.6192 1066.4464 1084.4815 1114.4449 1128.3224 1143.5688 1172.1333 1180.7076 1203.5513 1226.0375 1259.8632 1293.4884 1296.3715 1317.3595 1343.0964 1356.7488 1370.8216 1372.3236 1389.6006 1390.4933 1392.0781 1440.1530 1453.7187 1458.6827 1461.2399 1466.6436 1469.9174 1470.5225 1473.5890 1476.2750 1487.2678 1488.6761 1641.4710 2975.1920 2978.7010 2979.6218 2981.9649 2986.8934 2987.0577 2989.7103 2994.8157 3049.0382 3073.9032 3077.7664 3080.5914 3082.5626 3087.6220 3088.0845 3088.8969 3093.9878 3096.8586 3098.5240
redmass: 2.5943 4.0225 2.9981 2.5268 2.7109 1.0388 1.0396 1.0659 1.5697 1.2767 1.3321 2.3995 2.3096 2.6939 2.4648 2.5346 2.6506 4.2930 3.0521 3.0922 3.0841 2.8495 5.6053 3.5238 4.2087 3.3671 2.1430 2.2157 1.9312 1.2568 1.8721 1.5440 1.4193 1.7075 1.2810 1.8189 2.6531 2.1086 1.7917 2.4096 1.8611 2.1058 1.9036 2.6677 2.4441 1.9000 1.5280 1.3646 1.2628 1.6647 1.5884 1.2164 1.2151 1.2135 1.2098 1.2543 1.0828 1.0561 1.0478 1.0480 1.0496 1.0617 1.0473 1.0496 1.0491 1.0527 1.0582 10.4024 1.0715 1.0392 1.0346 1.0419 1.0553 1.0397 1.0399 1.0800 1.1026 1.0999 1.1004 1.0994 1.1000 1.0994 1.1004 1.0995 1.0992 1.1004 1.0993
irintensity: 0.0115 0.4687 2.1594 0.0313 1.1702 0.3192 0.0572 0.0873 0.2935 0.3626 0.2817 0.2838 1.4032 1.6577 1.4072 0.6119 1.3137 6.1212 2.8403 6.5642 2.7454 0.6030 2.3253 1.2490 8.6621 10.0363 6.7082 2.6384 9.7839 2.0426 10.7588 5.4141 1.9076 13.6783 1.2837 65.8106 159.6561 1.7340 17.9822 1.9603 26.4886 20.8161 1.0852 18.6556 36.5140 24.0325 18.8940 2.8800 6.8605 10.3174 9.9595 13.2942 23.4826 13.6043 35.9542 7.0851 3.3132 2.6927 6.2806 14.0142 7.4977 3.8968 1.4933 16.9249 9.7419 17.9642 12.8031 168.4683 3.0623 26.8555 44.8514 27.6853 33.1656 35.5057 32.4437 14.0719 21.6465 26.8274 17.9676 62.8490 36.9962 14.4423 28.8666 34.2441 42.6130 31.2727 40.6465
temp: 298.150 k
press: 1.00000 atm
elementType: 8 7 6 6 6 6 6 6 6 6 6 6 1 1 1 1 1 1 1 1 1 1 1 1 1 1 1 1 1 1 1
symmnumber: 1
zpe: 715110.6 jmol-1
zpe.correction: 0.272371 hartree
zpe.thermalcorrener: 0.286647 hartree
zpe.thermalcorrenthalpy: 0.287591 hartree
zpe.thermalcorrgfe: 0.232308 hartree
zpe.sumelectzpe: -521.461605 hartree
zpe.sumelectthermal: -521.447329 hartree
zpe.sumelectthermalent: -521.446385 hartree
zpe.sumelectthermalfe: -521.501669 hartree
dipole: -1.8537 0.9625 0.3362
dipole: 2.1156
quadrupole: -69.8499 -77.5666 -74.7100
quadrupole: -0.3839 -0.4507 0.3130
quadrupole: 4.1923 -3.5244 -0.6678 -0.3839 -0.4507 0.3130
hfenergy: -521.7339765 hartree
pointgroup: C01 [X(C10H19N1O1)]
dipole: -0.7331816 -0.3290928 -0.2166073 debye
polarizability: 130.5906701|-2.9487734|122.0566084|0.388438|6.6477094|99.5593373 unknown
InChI: InChI=1S/C10H19NO/c1-7(2)9-11-10(4,5)6-8(3)12-9/h7-8H,6H2,1-5H3
charge 0 multiplicity 1
31 atoms
O  0.21906 -1.395554 -0.104702
N  0.227764 1.005256 0.305381
C  -1.265261 1.110608 0.228939
C  -1.942275 -0.28345 0.38557
C  -1.233583 -1.35287 -0.463608
C  0.827556 -0.137288 0.173075
C  -1.701456 2.044133 1.382206
C  -1.624284 1.769063 -1.12933
C  2.337632 -0.311926 0.261414
C  -1.761833 -2.771506 -0.257638
C  2.932171 -0.422794 -1.170834
C  3.004209 0.822213 1.0661
H  -3.009078 -0.229385 0.097281
H  -1.895674 -0.594687 1.447975
H  -1.282864 -1.07985 -1.537884
H  -1.209931 3.02668 1.276105
H  -2.797889 2.189552 1.377215
H  -1.405402 1.62038 2.35848
H  -1.044731 2.700259 -1.253379
H  -1.384601 1.108901 -1.982497
H  -2.701566 2.016319 -1.166797
H  2.509232 -1.280621 0.772336
H  -1.70107 -3.056227 0.807491
H  -2.816634 -2.838909 -0.581293
H  -1.168742 -3.494564 -0.843698
H  2.786068 0.524905 -1.721097
H  2.45053 -1.238473 -1.737959
H  4.017039 -0.627603 -1.118859
H  2.609024 0.867751 2.096159
H  2.804753 1.798464 0.592646
H  4.097335 0.662421 1.113702
