program: Gaussian 09
title: 000293720
version: EM64L-G09RevD.01
frameworkgroup: C1[X(C7H12O4S)]
method: RPBEPBE
basis: SDD
operation: Freq
keyword: #p
keyword: freq=noraman
keyword: PBEPBE/SDD
title: #p freq=noraman PBEPBE/SDD
converged: YES YES NO NO
title: Mulliken charges:
elementType: S O O O O C C C C C C C H H H H H H H H H H H H
charge: 0.952455 -0.256892 -0.253517 -0.544933 -0.546630 -0.094024 -0.100964 -0.640837 -0.640678 0.034425 -0.391177 -0.679503 0.269955 0.270036 0.295912 0.326430 0.327088 0.295742 0.259950 0.218929 0.223230 0.216421 0.236771 0.221811
chargesum: 0.00000
title: Mulliken charges with hydrogens summed into heavy atoms:
elementType: S O O O O C C C C C C C
charge: 0.952455 -0.256892 -0.253517 -0.544933 -0.546630 0.175932 0.169072 -0.018495 -0.017849 0.294375 0.050982 -0.004500
polarizability: 1.31467475e+02 2.86475754e+00 9.96325890e+01 2.85386646e+00 2.12371028e+00 9.29146674e+01
1716.lowfreq: -9.0327 -7.1459 -0.0026 -0.0024 0.0022 4.7993 42.8403 64.5412 91.9076
frequency: 42.6674 64.4928 91.8771 101.6694 148.8740 191.3410 219.4626 237.6580 258.9457 277.8938 342.4865 351.0338 429.4133 454.6286 489.9570 503.5951 568.7724 593.3022 645.7433 729.3001 778.4119 798.7545 802.7998 838.8333 844.1635 860.3608 876.2717 902.3218 951.8540 980.7803 1008.3708 1039.6587 1064.4266 1072.7189 1103.3197 1128.2510 1139.2181 1164.2418 1172.8334 1227.4696 1254.0412 1274.5237 1285.6794 1295.4534 1316.7021 1322.9319 1342.2852 1389.0581 1400.5439 1400.9495 1405.5933 1456.8643 1478.4173 1489.6923 2981.6296 2989.6909 3010.3491 3051.6071 3060.2915 3063.4587 3065.8691 3071.5575 3088.1547 3099.3706 3164.0001 3164.9305
redmass: 3.7744 5.2965 4.0849 3.1638 3.0787 2.4632 2.6107 1.9586 5.3725 5.8599 3.7163 3.1032 3.4116 4.4284 6.0890 3.7672 5.1696 5.8545 5.9347 2.4096 3.2502 4.4095 2.9043 3.2925 2.8267 2.2738 2.3793 4.9363 2.1405 2.6058 3.0684 2.1119 3.5778 2.9931 1.7038 1.4621 1.1856 1.3633 1.8403 1.3147 1.1889 1.2903 1.2479 1.1860 1.1534 1.3052 1.2729 1.3095 1.0992 1.1026 1.3918 1.0819 1.0419 1.0605 1.0873 1.0363 1.0605 1.0826 1.0662 1.0608 1.1006 1.0786 1.1001 1.1011 1.1100 1.1109
irintensity: 1.9998 3.9102 4.9889 2.0638 0.6674 3.8530 0.5581 3.1932 7.9783 16.9847 11.8828 8.8501 4.2499 10.6146 28.7988 2.7369 6.1540 18.1162 2.6486 4.7464 4.7762 36.8373 29.9652 16.2144 31.1627 45.0895 23.3837 25.0226 1.0996 7.0398 194.5503 4.3516 66.9731 7.9708 5.5026 0.1001 30.2129 8.7878 3.8700 0.0199 0.8852 3.4315 2.3881 0.2770 3.6995 0.2160 5.6874 4.8042 24.1446 15.5675 24.1388 8.7353 13.5411 16.5807 12.7191 29.9626 16.1772 2.5216 4.8472 0.0977 2.8080 24.4196 44.9090 35.0815 1.7115 0.2842
temp: 298.150 k
press: 1.00000 atm
elementType: 16 8 8 8 8 6 6 6 6 6 6 6 1 1 1 1 1 1 1 1 1 1 1 1
symmnumber: 1
zpe: 492992.0 jmol-1
zpe.correction: 0.187771 hartree
zpe.thermalcorrener: 0.200227 hartree
zpe.thermalcorrenthalpy: 0.201171 hartree
zpe.thermalcorrgfe: 0.148593 hartree
zpe.sumelectzpe: -971.761290 hartree
zpe.sumelectthermal: -971.748834 hartree
zpe.sumelectthermalent: -971.747889 hartree
zpe.sumelectthermalfe: -971.800468 hartree
dipole: -2.2202 4.1239 1.8230
dipole: 5.0258
quadrupole: -92.6337 -80.7782 -77.0991
quadrupole: 11.6933 3.6557 -0.8862
quadrupole: -9.1301 2.7255 6.4046 11.6933 3.6557 -0.8862
hfenergy: -971.9490607 hartree
pointgroup: C01 [X(C7H12O4S1)]
dipole: -0.7762514 1.4887316 -1.0444532 debye
dipolederiv: 1.3144198 -0.0460184 0.050097 -0.0364152 1.1702335 -0.0394463 0.0502173 -0.0410298 1.1502884 -0.7922821 -0.175493 -0.1113551 -0.312631 -0.552902 -0.115594 0.0779648 -0.0447769 -0.4375888 -0.8566634 -0.0017079 0.1919647 -0.2527461 -0.4177634 0.0139228 0.2175454 -0.0189903 -0.5193676 -0.8443287 0.1073138 -0.1153092 -0.0400786 -0.4919991 -0.0174565 -0.0236029 0.0048919 -0.5148221 -0.6238742 -0.0986685 0.0527328 0.0258082 -0.6436613 0.0973351 -0.0328215 0.0796647 -0.5527535 0.6120694 0.059785 0.0913646 0.1624923 0.1497001 -0.1083564 -0.023227 -0.1645526 0.1857993 0.5989511 -0.0176993 0.0331949 0.1479745 0.2833874 -0.0926188 0.0006143 -0.063529 0.0258872 -0.1772788 0.0309143 -0.0059786 0.004005 -0.1290811 -0.0354344 -0.0751414 -0.0012624 -0.1809186 -0.1884817 0.0263812 -0.0275141 0.0672547 -0.1449098 -0.003223 0.0270278 -0.0404112 -0.1509891 0.8289077 0.1404133 -0.1173831 0.3226179 0.6308236 0.0787194 -0.1862763 0.0698689 0.6052414 -0.0843161 -0.0554392 0.0316989 -0.0171264 0.1192614 0.0057036 0.0144891 -0.0029666 0.0525487 0.0018634 -0.01073 0.0354297 -0.0032742 0.0690166 -0.0076438 -0.0156121 -0.0210935 -0.0014859 -0.0162482 0.0111387 -0.013062 -0.0352082 -0.0827537 0.0308282 -0.0211904 0.0872325 0.0776339 -0.021875 -0.0011207 -0.0185199 -0.0250296 0.0105672 0.1267055 0.0293057 0.0759272 -0.0111896 -0.0280427 -0.0130481 -0.0022134 -0.026545 -0.0106436 -0.0079161 -0.0017897 0.0133741 0.1083265 0.0925119 0.0170161 0.0474983 0.0333796 0.0673778 -0.0016885 0.0008593 0.0098346 0.0404973 0.1046546 -0.0255758 -0.0259585 0.0209486 0.0411008 -0.0013431 -0.0197833 -0.0216887 0.0566853 -0.0277178 -0.0242929 -0.0007898 -0.0357399 0.0822518 0.0517634 0.0118827 0.0341935 0.0157175 0.0386916 0.0521075 -0.0266658 -0.0473641 -0.0566677 0.0222557 0.0247425 0.0384573 -0.0399639 0.0529449 -0.0120179 0.0146531 -0.0356467 -0.055931 -0.111777 -0.0035378 -0.0896738 0.0103081 0.0296813 0.0240624 -0.012795 0.0773057 -0.0275247 0.1118226 -0.0224164 0.0897725 -0.0044677 0.0720719 0.0982717 -0.0590038 0.0643774 -0.0506586 0.1091264 -0.0176989 0.0821775 -0.0006297 0.1225112 -0.0406584 -0.0259708 -0.0135201 -0.0621363 -0.1106384 -0.0045077 -0.0781165 0.0106995 -0.20817 -0.0449341 0.0138852 -0.0448389 0.1029122 0.0049534 -0.0070434 0.0026967 0.0745432 unknown
polarizability: 131.7158992|2.9283007|96.4225749|0.5804787|-3.790559|95.8762571 unknown
InChI: InChI=1S/C7H12O4S/c1-2-7-10-5-3-12(8,9)4-6(5)11-7/h5-7H,2-4H2,1H3
charge 0 multiplicity 1
24 atoms
S  1.941743 -0.615189 0.445656
O  -1.31712 0.997447 0.301663
O  -1.027212 -0.274865 -1.627394
O  3.561178 -0.534842 0.636696
O  1.074101 -1.834621 1.115409
C  0.029971 1.350355 -0.166193
C  0.22952 0.47593 -1.49548
C  1.107694 1.090458 0.889902
C  1.456595 -0.437629 -1.434276
C  -1.632975 -0.330756 -0.276501
C  -3.134729 -0.520255 -0.381433
C  -3.804894 -0.603149 1.007202
H  0.000712 2.423875 -0.415337
H  0.294471 1.132371 -2.378744
H  1.949363 1.799641 0.860783
H  0.692927 0.969097 1.900051
H  1.245076 -1.45609 -1.787978
H  2.36225 -0.010275 -1.891792
H  -1.124143 -1.115528 0.321984
H  -3.313865 -1.450564 -0.952317
H  -3.547998 0.317964 -0.970766
H  -3.406306 -1.449796 1.595982
H  -3.632591 0.323827 1.580708
H  -4.894367 -0.747107 0.901576
