program: Gaussian 09
title: 000293709
version: EM64L-G09RevD.01
frameworkgroup: C1[X(C13H16BrNO)]
method: RPBEPBE
basis: SDD
operation: Freq
keyword: #p
keyword: freq=noraman
keyword: PBEPBE/SDD
title: #p freq=noraman PBEPBE/SDD
converged: YES YES NO NO
title: Mulliken charges:
elementType: Br O N C C C C C C C C C C C C C H H H H H H H H H H H H H H H H
charge: -0.008433 -0.285194 -0.098939 0.210474 -0.481575 0.000904 -0.712376 -0.712535 0.091203 -0.718796 0.254246 -0.300484 -0.345699 -0.186163 -0.210813 -0.203763 0.225506 0.213503 0.222798 0.215521 0.241170 0.207310 0.200429 0.232877 0.223409 0.212981 0.227092 0.235975 0.294076 0.270155 0.233342 0.251799
chargesum: 0.00000
title: Mulliken charges with hydrogens summed into heavy atoms:
elementType: Br O N C C C C C C C C C C C C C
charge: -0.008433 -0.285194 -0.098939 0.210474 -0.042566 0.223702 -0.048375 -0.055820 0.091203 -0.042748 0.254246 -0.006408 -0.075544 -0.186163 0.022530 0.048036
polarizability: 2.33099665e+02 -3.11988990e-01 1.84920563e+02 1.42686944e+00 6.80636509e-01 9.39106558e+01
1716.lowfreq: -9.6474 -3.1519 -0.0002 0.0002 0.0004 1.7006 23.7463 64.1193 70.1618
frequency: 23.7114 64.0911 70.1602 87.2229 135.6428 157.3238 170.9526 186.1981 195.5074 205.9802 227.0785 250.0214 280.5157 294.3098 313.3300 338.1607 366.0306 415.9553 444.9557 453.4763 482.0650 487.5515 511.3532 533.8583 637.8699 664.5710 679.3011 702.7003 774.8580 798.2944 802.2543 826.5076 880.5403 902.0067 924.5271 925.4317 933.5811 941.3700 971.8970 981.7843 990.8098 994.0105 1033.9809 1037.9360 1064.0938 1083.4690 1089.7547 1142.4196 1169.0788 1175.9305 1191.0130 1222.7397 1238.6851 1262.8628 1282.1231 1293.2232 1330.9335 1360.4057 1371.6258 1377.8120 1388.7586 1393.0225 1412.7266 1440.5948 1453.4095 1456.0066 1461.4072 1464.6663 1469.1668 1476.1706 1483.6910 1566.3631 1598.8524 1609.5456 2979.5559 2981.8340 2984.8293 2990.8851 2992.5683 3054.3781 3076.5090 3082.6414 3089.8789 3091.0613 3096.1504 3098.5887 3142.7514 3170.8547 3175.7570 3184.1534
redmass: 4.5681 3.9198 5.3551 4.4693 2.5521 4.6659 5.2004 1.2060 1.9851 1.2770 1.2607 2.3960 3.8250 3.5340 2.6523 3.2113 3.9885 3.0950 3.6910 3.4686 2.7183 3.4274 3.5271 4.9039 6.4462 5.2849 6.5931 2.5424 3.8691 1.8597 2.7534 3.6492 2.3397 2.3041 1.3824 1.6809 1.6265 1.4486 1.7308 5.6763 1.3445 1.2851 4.7095 1.8248 1.8872 2.1567 1.5520 1.8502 1.8824 1.2083 2.6598 2.8778 1.9398 1.8421 1.5038 1.5108 1.3377 1.5725 1.2172 8.9155 1.2249 1.2540 2.8815 1.0813 1.0570 2.4997 1.0474 1.0506 1.0608 1.0512 1.0549 7.0188 7.6026 9.7470 1.0408 1.0519 1.0544 1.0494 1.0528 1.1026 1.1001 1.0995 1.0994 1.0996 1.0993 1.1005 1.0879 1.0939 1.0924 1.0968
irintensity: 0.0259 2.2837 0.9289 0.4891 0.0641 0.0526 0.6850 0.0657 0.1164 0.2533 0.2681 0.0803 1.2229 1.7051 1.3895 1.3493 0.9612 2.5528 6.4237 1.6177 2.7638 2.6877 4.0965 6.5233 3.9637 0.3239 42.0075 41.9076 11.5180 29.2546 17.2731 46.4916 27.0276 9.1773 0.0721 1.4147 1.2881 13.2097 5.2249 0.6552 0.5001 2.6797 98.5856 2.1654 33.3552 11.4762 4.0092 35.9590 91.5972 2.2827 51.4802 7.8551 158.8189 49.7201 20.0646 19.7779 4.7004 13.3030 18.4360 0.0248 11.1633 22.6311 56.1843 3.4926 3.4337 27.8055 10.5506 11.3897 5.2231 9.8937 11.6543 52.4142 59.8709 80.1359 13.2071 18.6807 38.2594 17.0209 50.2075 21.2996 24.7830 49.9630 7.8324 35.7974 41.7340 30.4886 9.6704 4.7702 2.5712 7.9693
temp: 298.150 k
press: 1.00000 atm
elementType: 35 8 7 6 6 6 6 6 6 6 6 6 6 6 6 6 1 1 1 1 1 1 1 1 1 1 1 1 1 1 1 1
symmnumber: 1
zpe: 679614.3 jmol-1
zpe.correction: 0.258851 hartree
zpe.thermalcorrener: 0.274929 hartree
zpe.thermalcorrenthalpy: 0.275873 hartree
zpe.thermalcorrgfe: 0.214359 hartree
zpe.sumelectzpe: -647.227818 hartree
zpe.sumelectthermal: -647.211740 hartree
zpe.sumelectthermalent: -647.210796 hartree
zpe.sumelectthermalfe: -647.272310 hartree
dipole: 4.3537 1.4054 0.1612
dipole: 4.5778
quadrupole: -91.8776 -98.5734 -107.3602
quadrupole: -5.0167 0.6117 0.3976
quadrupole: 7.3928 0.6970 -8.0898 -5.0167 0.6117 0.3976
hfenergy: -647.4866695 hartree
pointgroup: C01 [X(C13H16Br1N1O1)]
dipole: 1.5126286 0.9693741 -0.1264453 debye
polarizability: 229.8863195|11.1304273|186.5613747|-5.9995883|-11.5283084|95.4831888 unknown
InChI: InChI=1S/C13H16BrNO/c1-9-8-13(2,3)15-12(16-9)10-5-4-6-11(14)7-10/h4-7,9H,8H2,1-3H3
charge 0 multiplicity 1
32 atoms
Br -4.389624 -2.332364 0.507004
O  1.041441 1.400491 -0.156325
N  0.967166 -1.006323 0.201015
C  2.450726 -1.161373 0.095259
C  3.10231 0.084168 -0.574824
C  2.532627 1.393619 -0.004085
C  3.003648 -1.396424 1.526389
C  2.70223 -2.421976 -0.765525
C  0.397844 0.155455 0.05511
C  3.032104 2.656212 -0.70298
C  -1.085289 0.309156 0.091868
C  -1.885572 -0.854243 0.249144
C  -1.703138 1.579825 -0.02724
C  -3.281763 -0.719376 0.286113
C  -3.110422 1.685206 0.010381
C  -3.918335 0.535384 0.168263
H  2.903078 0.060492 -1.664159
H  4.199045 0.068037 -0.432679
H  2.730472 1.45396 1.085608
H  2.892681 -0.499409 2.161765
H  2.448111 -2.21878 2.008997
H  4.073963 -1.670684 1.484762
H  3.786343 -2.613736 -0.86952
H  2.228261 -3.299883 -0.293756
H  2.266277 -2.300344 -1.773021
H  4.123265 2.762227 -0.56342
H  2.818401 2.611265 -1.785212
H  2.538882 3.551819 -0.287716
H  -1.386617 -1.822649 0.338358
H  -1.076993 2.467396 -0.147023
H  -3.589182 2.665815 -0.082792
H  -5.008837 0.614234 0.198444
