program: Gaussian 09
title: 000293724
version: EM64L-G09RevD.01
frameworkgroup: C1[X(C13H19N5O6)]
method: RPBEPBE
basis: SDD
operation: Freq
keyword: #p
keyword: freq=noraman
keyword: PBEPBE/SDD
title: #p freq=noraman PBEPBE/SDD
converged: YES YES NO NO
title: Mulliken charges:
elementType: O O O O O O N N N N N C C C C C C C C C C C C C H H H H H H H H H H H H H H H H H H H
charge: -0.238947 -0.419599 -0.465485 -0.426261 -0.267303 -0.224512 -0.163069 -0.099105 -0.412799 0.011955 -0.159865 -0.153186 -0.166260 -0.152904 -0.063728 -0.389389 -0.221980 -0.450091 -0.440695 0.229465 -0.354277 -0.346661 0.026815 0.136910 0.277246 0.282061 0.304319 0.248543 0.227531 0.215598 0.351576 0.357983 0.227180 0.232152 0.232847 0.230241 0.338397 0.242210 0.250936 0.225955 0.261298 0.358890 0.346007
chargesum: 0.00000
title: Mulliken charges with hydrogens summed into heavy atoms:
elementType: O O O O O O N N N N N C C C C C C C C C C C C C
charge: -0.238947 -0.068023 -0.107502 -0.080255 -0.267303 -0.224512 -0.163069 -0.099105 -0.053910 0.011955 -0.159865 0.124060 0.115801 0.151415 0.184814 0.053740 0.116418 0.009242 0.022393 0.229465 0.138870 0.140592 0.026815 0.136910
polarizability: 3.24685037e+02 -2.87424377e+01 2.09871038e+02 -1.27154432e+00 -6.31023631e+00 1.30202537e+02
1716.lowfreq: -10.2357 -5.6255 -2.7290 -0.0008 -0.0006 0.0008 16.3010 19.6369 27.5337
frequency: 15.5606 19.3264 27.5270 38.0738 45.8459 67.9919 79.2163 88.6255 93.8987 126.0595 137.5169 163.9670 178.3009 188.3105 193.7378 217.3538 232.0972 249.1265 258.7751 290.3002 304.7346 333.5513 351.6255 361.2637 364.9525 374.6415 386.0836 405.5350 423.1405 437.1879 469.9408 480.3762 525.8931 530.1096 568.2271 576.6005 635.9502 637.6956 671.4416 700.1387 722.4060 731.2900 751.2063 770.0838 781.5612 828.2404 850.8712 851.5771 867.8261 875.2665 894.0740 903.1051 922.2038 930.6597 950.2304 954.0595 967.1513 978.0542 993.3792 1003.4865 1027.7188 1046.7614 1052.6134 1088.0052 1102.2055 1105.6562 1123.5028 1134.0917 1152.9463 1154.5172 1181.4002 1192.2494 1201.2368 1205.9679 1208.3399 1217.7808 1246.1929 1247.5739 1256.9249 1272.3053 1289.8070 1298.6842 1301.8688 1308.3627 1316.8316 1328.2603 1330.3127 1343.0996 1349.0599 1356.9875 1365.2701 1367.9546 1371.7757 1385.5946 1396.9129 1432.2038 1469.1820 1473.9425 1476.2258 1483.5974 1492.6623 1599.3632 1628.8078 1655.5077 2976.6655 2983.6586 2988.0936 2995.0165 3011.9686 3015.9837 3028.3682 3049.5465 3079.0242 3081.6736 3085.5194 3087.6865 3089.5576 3096.8630 3123.1149 3518.5450 3537.7537 3563.4743 3580.6896
redmass: 4.2028 5.4198 4.7195 3.8066 6.7209 5.4366 4.5808 4.2273 4.9455 5.8195 4.2787 5.6134 4.9275 4.5714 3.7897 6.9473 1.9043 5.2546 3.7533 1.5290 5.8169 2.7426 1.3933 1.5739 2.9701 8.1618 3.1423 5.7155 3.5632 5.5030 6.9861 5.5673 5.5993 7.2274 1.9017 7.7878 6.1165 5.4561 4.8876 3.0185 6.0894 4.7222 5.5486 2.8515 2.2563 2.1303 2.2784 2.0117 3.6672 3.9675 4.9433 2.5163 1.3558 3.1513 1.5568 2.4271 4.1912 1.8592 3.9847 5.8478 3.6801 1.9637 1.9478 3.2377 1.4887 1.6942 5.1762 1.1768 1.5835 1.4039 3.2313 2.1146 1.4308 1.9156 1.5612 1.3636 1.9342 1.5855 1.4354 1.6473 1.7604 1.4684 1.3554 1.2590 1.3927 2.0437 2.1005 1.2811 2.1077 1.2895 1.9481 1.3298 1.8725 3.5546 1.5892 1.5591 1.0880 1.0877 1.0861 1.0814 1.0898 5.1731 11.1717 6.0291 1.0678 1.0847 1.0633 1.0647 1.0646 1.0633 1.0866 1.0979 1.0964 1.1009 1.1007 1.0870 1.0880 1.1053 1.0959 1.0768 1.0661 1.0663 1.0665
irintensity: 0.3620 0.6817 1.1893 0.3987 0.7209 1.3215 0.1346 1.0544 3.6745 1.7537 1.5086 9.8057 3.1240 1.9858 1.3830 6.3200 1.8481 10.8239 25.6705 174.1327 7.1737 76.0081 4.5595 115.7254 47.2676 10.2662 85.9908 6.6367 10.9126 10.9752 11.8478 22.3211 10.3042 6.5515 1.9771 28.0997 4.4077 11.7150 14.9504 10.1320 2.0599 15.7724 26.3854 3.5679 100.3951 12.5150 14.2084 11.8683 34.1775 39.1385 17.9438 9.7723 0.4136 28.5046 39.2570 14.4393 197.2237 4.6196 58.7088 167.2120 62.9334 10.8952 5.0051 45.0083 9.2752 1.8890 39.3036 38.9382 20.0228 1.3514 3.6182 19.2264 52.0785 76.7186 12.0754 5.7717 63.2468 35.5618 6.6411 22.9060 147.6024 40.8109 33.5428 0.8016 11.6601 143.9126 155.2638 20.8893 45.4747 24.4669 80.3634 15.9644 95.6962 301.2018 16.9579 61.1501 9.2442 8.4900 6.2256 5.9976 2.1314 56.8056 278.5339 685.7882 73.7088 20.0855 11.3489 42.2351 33.0547 33.2064 20.1157 19.7688 29.2582 21.9964 25.3160 11.8555 14.3327 56.7647 94.6721 55.1014 14.8900 10.2207 12.1257
temp: 298.150 k
press: 1.00000 atm
elementType: 8 8 8 8 8 8 7 7 7 7 7 6 6 6 6 6 6 6 6 6 6 6 6 6 1 1 1 1 1 1 1 1 1 1 1 1 1 1 1 1 1 1 1
symmnumber: 1
zpe: 877526.1 jmol-1
zpe.correction: 0.334232 hartree
zpe.thermalcorrener: 0.357665 hartree
zpe.thermalcorrenthalpy: 0.358610 hartree
zpe.thermalcorrgfe: 0.278329 hartree
zpe.sumelectzpe: -1229.986150 hartree
zpe.sumelectthermal: -1229.962716 hartree
zpe.sumelectthermalent: -1229.961772 hartree
zpe.sumelectthermalfe: -1230.042052 hartree
dipole: 3.1344 -6.2974 1.0492
dipole: 7.1121
quadrupole: -126.1177 -150.6696 -138.2952
quadrupole: -9.6347 3.8908 0.6495
quadrupole: 12.2431 -12.3087 0.0656 -9.6347 3.8908 0.6495
hfenergy: -1230.3203816 hartree
pointgroup: C01 [X(C13H19N5O6)]
dipole: -1.2284286 2.4872771 0.366021 debye
polarizability: 324.2036227|-27.3293773|209.8332897|-14.2583818|3.7080841|130.7216997 unknown
InChI: InChI=1S/C13H19N5O6/c19-6-8-9(20)10(21)12(24-8)18-5-7(11(22)14-13(18)23)15-16-17-3-1-2-4-17/h5,8-10,12,14,19-21H,1-4,6H2
charge 0 multiplicity 1
43 atoms
O  3.299956 -0.096534 -1.150995
O  4.585973 0.240584 1.687033
O  1.735144 2.385359 0.709476
O  3.972144 3.534116 -1.791955
O  2.413252 -3.447388 -0.130344
O  -2.207126 -2.937737 -0.366629
N  1.543094 -1.259076 0.120808
N  -4.043937 0.536217 0.608884
N  0.10135 -3.101707 -0.187305
N  -3.080294 -0.399761 0.602487
N  -1.906637 0.077469 0.205806
C  3.215668 0.378301 1.185795
C  3.026282 1.73706 0.431382
C  2.918487 -0.721184 0.132211
C  3.02201 1.365267 -1.072645
C  4.095057 2.076436 -1.911994
C  0.413275 -0.439076 0.210252
C  -5.316776 2.529154 0.426321
C  -6.263549 1.295972 0.354019
C  1.424197 -2.665385 -0.071112
C  -3.906406 1.94674 0.158589
C  -5.425271 0.157715 0.982415
C  -0.887988 -0.904723 0.122673
C  -1.115512 -2.347172 -0.149602
H  2.580561 0.300954 2.081891
H  3.861152 2.414825 0.689963
H  3.572471 -1.599257 0.252291
H  2.009884 1.574202 -1.476204
H  4.032419 1.741539 -2.966329
H  5.101838 1.840626 -1.529409
H  5.207596 0.163435 0.916849
H  1.762466 2.820404 1.597869
H  -5.355722 2.979327 1.435082
H  -5.585166 3.310709 -0.303776
H  -6.496442 1.055503 -0.699118
H  -7.214208 1.457835 0.888425
H  0.587015 0.629638 0.377798
H  -3.620742 1.963666 -0.911727
H  -3.09686 2.45114 0.715702
H  -5.537135 0.134668 2.084888
H  -5.658797 -0.844489 0.588481
H  -0.012482 -4.10754 -0.351523
H  3.085664 3.818572 -2.130921
