program: Gaussian 09
title: 000293700
version: EM64L-G09RevD.01
frameworkgroup: C1[X(C16H21NO)]
method: RPBEPBE
basis: SDD
operation: Freq
keyword: #p
keyword: freq=noraman
keyword: PBEPBE/SDD
title: #p freq=noraman PBEPBE/SDD
converged: YES YES NO NO
title: Mulliken charges:
elementType: O N C C C C C C C C C C C C C C C C H H H H H H H H H H H H H H H H H H H H H
charge: -0.257461 -0.109031 0.010963 -0.546239 -0.543972 0.161879 0.480525 0.220014 -0.483419 -0.002004 -0.420275 -0.424655 -0.718717 -0.718875 -0.720969 -0.232574 -0.232135 -0.245175 0.260869 0.240256 0.239751 0.266669 0.221651 0.210786 0.218451 0.237948 0.238336 0.236593 0.204587 0.215085 0.219918 0.198831 0.230188 0.242506 0.207798 0.223916 0.221679 0.221746 0.224557
chargesum: 0.00000
title: Mulliken charges with hydrogens summed into heavy atoms:
elementType: O N C C C C C C C C C C C C C C C C
charge: -0.257461 -0.109031 0.010963 -0.045114 -0.037552 0.161879 0.480525 0.220014 -0.050982 0.216447 -0.182327 -0.186319 -0.062453 -0.069938 -0.046749 -0.010895 -0.010389 -0.020618
polarizability: 2.12089198e+02 -2.15864551e+01 1.62523352e+02 -4.89461269e-01 -1.01111688e+00 1.54143992e+02
1716.lowfreq: -8.4387 -3.8173 0.0001 0.0006 0.0006 9.5107 13.9272 22.7618 56.1416
frequency: 11.7099 21.8231 56.1360 78.0258 90.8988 132.9725 161.7015 178.8813 200.3188 206.4970 225.8006 240.1249 247.9502 269.4701 285.4848 314.3789 331.4311 372.0739 405.0211 431.2246 436.7612 447.7058 481.7592 508.7229 511.8749 536.3529 610.0481 616.1705 679.4833 703.9887 727.0039 769.5998 781.9885 795.1976 807.1816 835.7304 852.0707 870.3509 896.0285 899.2924 915.8569 927.8189 934.8649 947.9136 955.7658 976.4951 978.4079 991.3834 991.6808 993.2780 1022.7751 1036.0844 1058.0928 1075.9556 1081.3603 1086.7191 1092.2579 1115.1189 1143.9658 1170.1704 1171.4658 1181.9488 1183.8811 1197.3649 1227.3894 1252.8084 1284.3698 1291.5294 1312.5949 1325.2710 1334.2120 1356.8567 1372.2057 1375.8483 1389.5376 1390.5910 1422.5487 1433.2173 1440.2287 1448.0118 1454.1499 1460.3062 1467.3031 1469.8267 1476.4891 1485.4317 1488.2893 1589.7061 1611.6693 1617.1975 2975.7734 2978.3127 2981.7004 2987.9461 2990.6520 3050.5027 3072.9053 3079.3952 3087.0519 3089.2703 3092.9346 3096.2296 3099.5450 3103.4234 3116.7075 3121.6779 3134.1063 3143.6438 3160.0544 3204.2618 3220.2143
redmass: 3.8988 3.7383 4.5093 3.9040 3.7884 2.5540 3.6503 3.3507 1.0453 1.0764 2.5531 2.7990 1.3843 2.1507 2.6799 2.5081 2.6128 4.0946 2.8232 2.8696 3.2636 4.3315 2.7172 3.6779 3.3829 3.5094 3.6142 6.4338 7.3811 1.6933 3.9260 2.0173 2.8960 4.3247 1.2031 2.1905 1.2950 6.8939 2.2661 1.9439 1.6006 1.6445 1.8169 3.3913 1.1772 1.3813 1.7430 1.3771 5.0276 1.2814 2.3691 1.7084 1.6656 1.5059 1.7689 1.7690 1.3997 2.8634 1.8802 1.0527 2.1303 1.2889 1.1136 2.8269 2.6702 1.8783 2.4846 1.5905 1.3427 1.6741 2.5760 1.6202 1.2171 7.9859 1.2166 1.2485 1.0883 2.2238 1.0843 1.2853 1.0551 1.0488 1.0507 1.0610 1.0490 1.0561 2.5233 6.2292 8.7734 7.2928 1.0547 1.0489 1.0464 1.0607 1.0387 1.1025 1.1001 1.0993 1.0997 1.0993 1.0992 1.0504 1.1003 1.0607 1.0842 1.0873 1.0921 1.0966 1.1016 1.1175 1.1161
irintensity: 0.1248 0.0757 0.3887 0.4050 1.7533 0.0667 1.4216 0.0314 0.0500 0.1084 0.5461 0.5069 0.0530 0.0693 0.2609 1.5828 1.6970 1.0051 0.0053 0.9624 0.6756 6.1379 3.2026 2.5862 4.0389 26.6951 4.6149 0.1214 4.4534 55.6268 0.4673 30.4783 5.1866 3.3969 13.0186 2.5724 0.0682 2.1865 2.9660 13.7402 0.3034 2.2549 5.4126 5.2851 0.0391 0.0517 10.3160 0.0384 0.1407 1.8660 17.1362 43.5211 62.8979 15.8376 63.0620 24.0371 1.9334 63.4572 42.6733 0.0134 30.6528 0.0473 0.1066 21.2535 38.5540 26.0883 48.9155 33.8728 0.7773 8.6525 20.2671 10.0074 20.6960 0.0411 13.4580 22.0303 14.0497 6.7818 3.1161 15.0153 1.9608 14.1163 7.3671 5.1910 11.4361 12.6571 11.8763 1.0286 210.0097 55.3343 3.2197 30.5384 36.9808 28.7892 34.1621 21.0927 25.2163 54.7027 4.4982 43.8117 44.2323 13.2880 24.7414 12.0335 4.2094 0.0020 21.6529 46.3245 24.4909 0.4916 14.4513
temp: 298.150 k
press: 1.00000 atm
elementType: 8 7 6 6 6 6 6 6 6 6 6 6 6 6 6 6 6 6 1 1 1 1 1 1 1 1 1 1 1 1 1 1 1 1 1 1 1 1 1
symmnumber: 1
zpe: 866238.5 jmol-1
zpe.correction: 0.329933 hartree
zpe.thermalcorrener: 0.347694 hartree
zpe.thermalcorrenthalpy: 0.348638 hartree
zpe.thermalcorrgfe: 0.283110 hartree
zpe.sumelectzpe: -750.894686 hartree
zpe.sumelectthermal: -750.876925 hartree
zpe.sumelectthermalent: -750.875981 hartree
zpe.sumelectthermalfe: -750.941509 hartree
dipole: 1.3202 1.8256 0.1143
dipole: 2.2558
quadrupole: -101.0023 -107.9666 -102.6984
quadrupole: 3.0301 0.0991 0.0358
quadrupole: 2.8868 -4.0775 1.1907 3.0301 0.0991 0.0358
hfenergy: -751.224619 hartree
pointgroup: C01 [X(C16H21N1O1)]
dipole: -0.6055109 0.520458 0.387503 debye
polarizability: 204.9751209|26.4051938|166.8238235|8.9570191|5.2398192|156.9575967 unknown
InChI: InChI=1S/C16H21NO/c1-12-11-15(2,3)17-14(18-12)16(9-10-16)13-7-5-4-6-8-13/h4-8,12H,9-11H2,1-3H3
charge 0 multiplicity 1
39 atoms
O  -0.547068 0.758248 0.553544
N  -1.734649 -1.059123 -0.539389
C  0.712292 -0.901125 -0.671232
C  0.898071 -2.439667 -0.675393
C  0.728188 -1.699335 -1.997042
C  -0.647707 -0.417775 -0.225379
C  1.901379 -0.029195 -0.337069
C  -3.068925 -0.631212 -0.015642
C  -2.913467 0.350128 1.185213
C  -1.847062 1.42031 0.899058
C  2.602631 -0.20146 0.881971
C  2.327771 0.984745 -1.230608
C  -3.856139 0.020937 -1.182647
C  -3.801133 -1.914646 0.441993
C  -1.543287 2.344156 2.076616
C  3.704894 0.620825 1.203979
C  3.429286 1.810505 -0.913661
C  4.12178 1.631813 0.306711
H  0.046396 -3.027146 -0.322185
H  1.891195 -2.820778 -0.419007
H  1.607745 -1.576424 -2.636015
H  -0.233956 -1.803055 -2.504738
H  -2.60741 -0.21814 2.085812
H  -3.878927 0.841562 1.409422
H  -2.134196 2.017144 0.009161
H  2.277911 -0.98338 1.57871
H  1.791251 1.1222 -2.177156
H  -3.86107 -0.65911 -2.052081
H  -4.90252 0.217877 -0.883479
H  -3.395816 0.972717 -1.503746
H  -3.228961 -2.427472 1.235789
H  -4.808259 -1.674564 0.831103
H  -3.903933 -2.611995 -0.407467
H  -0.717245 3.030447 1.823551
H  -2.435576 2.944474 2.331985
H  -1.245931 1.757812 2.963648
H  4.238129 0.475449 2.150649
H  3.748612 2.589871 -1.615337
H  4.978406 2.269684 0.553259
