program: Gaussian 09
title: 000293688
version: EM64L-G09RevD.01
frameworkgroup: C1[X(C17H25NO2)]
method: RPBEPBE
basis: SDD
operation: Freq
keyword: #p
keyword: freq=noraman
keyword: PBEPBE/SDD
title: #p freq=noraman PBEPBE/SDD
converged: YES YES NO NO
title: Mulliken charges:
elementType: O O N C C C C C C C C C C C C C C C C C H H H H H H H H H H H H H H H H H H H H H H H H H
charge: -0.480085 -0.331160 -0.336224 0.161846 -0.510596 -0.475580 -0.381978 -0.400305 -0.388493 0.412029 0.140158 -0.379861 -0.359934 -0.271262 0.019167 -0.248989 -0.099280 -0.284790 -0.685670 -0.694217 0.220525 0.208581 0.194725 0.234072 0.208197 0.190612 0.190322 0.230683 0.182537 0.199742 0.363231 0.228004 0.264862 0.228040 0.232283 0.215840 0.225632 0.214570 0.215717 0.200286 0.244750 0.227010 0.216188 0.207084 0.251729
chargesum: 0.00000
title: Mulliken charges with hydrogens summed into heavy atoms:
elementType: O O N C C C C C C C C C C C C C C C C C
charge: -0.116853 -0.331160 -0.084494 0.161846 -0.081491 -0.046783 0.016831 0.020700 -0.006214 0.412029 0.140158 -0.151857 -0.095072 -0.043222 0.019167 -0.016706 0.116560 0.155412 -0.024917 -0.043934
polarizability: 2.14932799e+02 3.26961443e+00 2.19581777e+02 2.16134143e+01 1.59378540e+00 1.55727045e+02
1716.lowfreq: -20.3388 -4.1671 0.0006 0.0008 0.0009 1.8252 17.9973 28.2079 47.1763
frequency: 7.8128 27.4903 47.1461 63.2790 81.5033 86.8540 103.3396 139.0896 158.1187 197.3088 205.2500 213.2594 227.3339 240.0391 243.7747 267.0737 291.5031 321.9904 325.8066 328.6590 373.1936 388.4368 396.2087 421.4462 434.5370 468.1717 480.3536 487.2349 541.8431 561.6852 612.9976 629.9436 650.9512 691.0602 693.9180 756.7910 759.7274 771.2847 774.5588 795.6470 825.9574 833.4876 845.5992 874.8497 881.9273 896.4983 911.6867 920.5084 925.5227 927.8835 951.4756 954.8054 960.7825 969.8578 985.2572 990.2217 999.4513 1046.4340 1051.6443 1055.9434 1083.2508 1096.6965 1108.8493 1130.1354 1136.5567 1142.7237 1150.3052 1174.8082 1178.3925 1189.7662 1194.0307 1228.5747 1236.4190 1254.4876 1259.7226 1274.2128 1279.8596 1299.9353 1319.7094 1335.7285 1337.9655 1340.8387 1341.8590 1348.8191 1358.0248 1366.0512 1381.5614 1385.8656 1401.1594 1423.6240 1446.9328 1453.1743 1455.3796 1463.0485 1463.3610 1469.8485 1470.3664 1473.9388 1475.3176 1483.3234 1491.1548 1572.7576 1605.7945 1640.9476 2951.8654 2956.1411 2971.4109 2974.2362 2977.2816 2981.7415 2983.6506 2987.7330 2999.5532 3020.9348 3025.6195 3026.7605 3044.9962 3050.9283 3065.3462 3066.9882 3072.3596 3081.7086 3093.4496 3124.2683 3139.0875 3152.2962 3168.7728 3387.2065 3395.5833
redmass: 3.8376 3.8478 2.6303 4.1046 4.2806 3.7355 3.3155 2.8930 3.3527 1.8189 1.4652 2.8544 3.6473 1.7885 1.5623 3.7272 3.2362 4.5728 3.7966 2.4778 2.5735 2.6322 2.8441 2.4570 2.5402 2.9123 2.3534 2.8114 3.5893 3.9622 2.4513 4.5756 3.3256 3.9531 1.4031 3.0071 2.7475 1.5655 1.8010 1.3421 2.8483 2.5036 1.7725 1.5098 3.2169 2.9668 2.2397 1.2995 1.2284 1.4704 1.8142 1.9937 1.4288 1.7995 3.6739 1.4554 3.1697 2.1369 1.7049 1.9039 1.8941 1.5187 1.9239 1.7632 2.0091 2.2183 1.7527 1.4111 1.0984 1.8208 2.4532 2.7512 1.2736 1.2936 1.3432 1.3643 1.4341 1.3441 1.3308 1.4133 1.4289 1.4242 1.4332 1.4445 1.8437 3.1561 1.2311 1.4980 1.2173 2.1021 1.0972 1.0973 1.1129 1.0750 1.0766 1.4347 1.0628 1.4745 1.0726 1.0492 1.0565 6.7390 6.0507 7.4945 1.0548 1.0636 1.0591 1.0362 1.0458 1.0750 1.0621 1.0616 1.0617 1.1075 1.0951 1.1009 1.1024 1.1008 1.0993 1.1023 1.0987 1.0989 1.0995 1.0852 1.0895 1.0944 1.0998 1.0757 1.0673
irintensity: 0.4452 0.4594 0.3928 0.1010 0.0721 0.2245 1.2872 2.8249 0.6849 1.0789 0.7806 0.1950 6.5638 0.1153 0.1359 3.9081 0.8583 5.6615 3.1156 0.8475 1.6407 2.2301 1.5940 4.2861 0.6872 5.6581 1.2728 2.1402 8.9856 2.3665 25.9453 3.5039 59.3644 6.2443 223.3682 5.2560 55.5341 0.7114 12.1866 72.5872 1.2838 15.0946 14.6627 0.7788 16.0775 4.0958 6.4731 9.1036 4.0138 5.2353 1.9843 64.6085 9.3159 23.7389 206.8500 23.7018 19.9253 13.9320 4.4498 9.0766 77.1817 5.1460 45.2327 12.6460 4.6761 5.1941 1.2996 1.7429 2.7249 5.4120 7.0657 133.8585 1.0161 11.7349 11.5488 3.2295 10.1168 0.6953 0.8348 1.9892 4.8564 0.3516 3.5819 2.4506 2.0399 4.3876 28.4026 10.5118 16.4675 12.6673 5.4756 6.3167 6.5886 2.8053 15.1639 12.1222 1.1044 10.0707 4.0745 11.7325 20.8494 1.2625 6.2348 149.0096 27.8797 42.1664 24.1576 35.2199 15.4004 25.9194 42.7236 44.7882 32.5955 33.2205 74.2184 27.0598 33.5354 29.1352 18.6051 57.3785 57.7855 37.7418 33.7204 4.1959 16.3223 21.4419 21.4017 27.7624 216.6288
temp: 298.150 k
press: 1.00000 atm
elementType: 8 8 7 6 6 6 6 6 6 6 6 6 6 6 6 6 6 6 6 6 1 1 1 1 1 1 1 1 1 1 1 1 1 1 1 1 1 1 1 1 1 1 1 1 1
symmnumber: 1
zpe: 1013844.8 jmol-1
zpe.correction: 0.386153 hartree
zpe.thermalcorrener: 0.406418 hartree
zpe.thermalcorrenthalpy: 0.407362 hartree
zpe.thermalcorrgfe: 0.335924 hartree
zpe.sumelectzpe: -866.453625 hartree
zpe.sumelectthermal: -866.433360 hartree
zpe.sumelectthermalent: -866.432416 hartree
zpe.sumelectthermalfe: -866.503854 hartree
dipole: -2.4814 -0.8760 2.2584
dipole: 3.4677
quadrupole: -102.4339 -121.0043 -127.9856
quadrupole: 3.2683 6.4951 3.7163
quadrupole: 14.7074 -3.8631 -10.8443 3.2683 6.4951 3.7163
hfenergy: -866.8397778 hartree
pointgroup: C01 [X(C17H25N1O2)]
dipole: -0.9195002 0.2211844 -0.9833128 debye
polarizability: 214.6842901|-7.6893764|218.2825963|-19.3469118|-11.9390227|157.2747354 unknown
InChI: InChI=1S/C17H25NO2/c1-13(2)12-20-16(18)14-8-4-5-9-15(14)17(19)10-6-3-7-11-17/h4-5,8-9,13,18-19H,3,6-7,10-12H2,1-2H3
charge 0 multiplicity 1
45 atoms
O  0.426469 1.316877 0.956294
O  -1.802292 0.020277 0.297767
N  -1.904676 -1.255496 2.382495
C  1.391658 0.519074 0.183816
C  1.401572 1.02074 -1.297207
C  2.751387 0.824648 0.877634
C  1.799725 2.511112 -1.396992
C  3.134155 2.31673 0.761822
C  3.162403 2.776507 -0.71534
C  1.08918 -1.001812 0.231652
C  -0.073269 -1.611227 0.80011
C  2.088647 -1.870977 -0.289438
C  -0.15011 -3.03023 0.900599
C  1.987544 -3.273527 -0.222587
C  -1.308815 -0.913474 1.283183
C  0.865546 -3.863389 0.400405
C  -3.507187 1.444164 -0.714318
C  -3.151763 0.595364 0.517555
C  -3.566262 0.58071 -1.994134
C  -4.846508 2.176331 -0.45878
H  0.397568 0.850679 -1.735493
H  2.113219 0.407328 -1.88447
H  3.547688 0.205602 0.424193
H  2.664103 0.525626 1.938393
H  1.024942 3.126887 -0.900621
H  1.831443 2.814597 -2.46187
H  4.121202 2.481239 1.236567
H  2.392158 2.91768 1.319134
H  3.959946 2.226601 -1.259365
H  3.415621 3.852679 -0.776913
H  -0.474659 1.175411 0.550384
H  2.982433 -1.43619 -0.749544
H  -1.033902 -3.457978 1.383637
H  2.78537 -3.898816 -0.638626
H  0.778849 -4.951595 0.48761
H  -2.709181 2.205018 -0.837283
H  -3.143301 1.214036 1.438711
H  -3.878578 -0.234187 0.642025
H  -3.762242 1.210666 -2.880633
H  -4.379467 -0.167598 -1.923997
H  -2.616919 0.04099 -2.15269
H  -5.111855 2.804566 -1.327521
H  -4.794077 2.832458 0.430182
H  -5.670954 1.453704 -0.304923
H  -2.802909 -0.783203 2.593378
