program: Gaussian 09
title: 000293698
version: EM64L-G09RevD.01
frameworkgroup: C1[X(C18H21NO2)]
method: RPBEPBE
basis: SDD
operation: Freq
keyword: #p
keyword: freq=noraman
keyword: PBEPBE/SDD
title: #p freq=noraman PBEPBE/SDD
converged: YES YES NO NO
title: Mulliken charges:
elementType: O O N C C C C C C C C C C C C C C C C C C H H H H H H H H H H H H H H H H H H H H H
charge: -0.284360 -0.253107 -0.208967 -0.226152 0.298719 0.080402 -0.532131 -0.510918 -0.426183 -0.545263 -0.012538 0.333345 -0.490555 -0.575418 0.061788 0.300209 -0.398737 -0.425809 -0.257018 -0.238836 -0.513068 0.241710 0.242148 0.246001 0.224801 0.245057 0.225672 0.249500 0.269362 0.216413 0.201249 0.219518 0.215423 0.220500 0.235881 0.242285 0.236774 0.230110 0.229306 0.195454 0.201239 0.236193
chargesum: 0.00000
title: Mulliken charges with hydrogens summed into heavy atoms:
elementType: O O N C C C C C C C C C C C C C C C C C C
charge: -0.284360 -0.253107 -0.208967 0.015559 0.298719 0.080402 -0.043983 -0.041061 0.048990 -0.059488 0.188711 0.333345 -0.055614 -0.119037 0.061788 0.300209 -0.156452 -0.189035 -0.026908 -0.009530 0.119818
polarizability: 2.70356647e+02 7.57158321e+00 2.11389858e+02 3.10322788e+00 5.72470497e+00 1.31424429e+02
1716.lowfreq: -10.7726 -4.9358 -0.0001 0.0003 0.0005 2.1013 25.5799 47.3029 58.5184
frequency: 25.5115 47.2329 58.4618 62.4273 90.7996 120.6979 131.4220 165.9411 181.9940 211.9689 225.8176 247.9625 251.7220 277.2932 296.5249 323.4340 348.2234 358.7229 386.5834 428.2087 436.4239 451.1758 479.2854 509.1986 511.1122 535.0966 548.9409 582.6633 599.9146 625.7886 656.8723 671.8604 690.9558 734.0998 751.1371 763.3846 788.9665 813.5687 846.6250 861.5813 875.5859 883.5330 915.7128 946.2216 950.4727 969.8691 988.0416 990.2962 998.6979 1018.1790 1025.7365 1035.3951 1042.9016 1057.8227 1063.3985 1106.8582 1113.2827 1118.2426 1128.0142 1149.9205 1152.0124 1158.6488 1174.8645 1180.0052 1196.8931 1205.5759 1210.6361 1225.0650 1232.8414 1239.1679 1261.7678 1287.2779 1293.7295 1299.9584 1310.9973 1327.9839 1336.0899 1339.4547 1344.5458 1352.8723 1359.1386 1370.1973 1387.9948 1428.1823 1432.6281 1440.1781 1443.5318 1446.2630 1451.6904 1452.1191 1456.5976 1470.0717 1476.2550 1476.5979 1490.3507 1552.0633 1579.9968 1596.6977 1617.2347 2893.0829 2919.8403 2932.4266 2940.6900 2972.4050 2977.8824 2980.6475 2985.5541 2990.3668 2996.0973 3036.8685 3042.7480 3048.3275 3050.2071 3081.8639 3088.8588 3095.0996 3115.1159 3119.3204 3139.9301 3161.7313
redmass: 4.2395 3.4683 4.0702 3.5789 2.9809 3.4135 3.4214 3.1405 1.6922 2.3054 2.8522 3.4376 3.5194 4.4703 2.5763 2.6098 4.6290 2.2948 3.1274 3.9806 2.8816 3.2048 3.5259 3.5630 4.1384 3.0471 4.2940 4.3433 3.5543 5.1419 3.5051 3.6520 3.0425 4.0146 2.3972 1.5813 3.1258 2.3545 2.9793 2.6685 1.3835 2.1650 2.5460 2.4957 1.4094 2.4637 1.3266 2.4037 2.9260 3.8548 3.1706 2.4717 2.2745 2.7377 2.5756 1.4950 1.6713 1.6103 2.4178 1.3733 1.2847 1.2181 1.0941 1.2662 1.8747 1.7247 1.6804 1.6621 1.4423 1.5729 1.5796 1.6760 1.8920 1.3739 1.5381 1.5543 1.6615 1.3438 1.5146 1.7510 1.5694 1.5902 5.2736 1.4850 1.1326 1.4973 2.1039 1.2180 1.1543 1.3352 1.0859 1.0787 1.1190 1.0593 2.4251 10.2646 6.5655 6.9584 6.4942 1.0814 1.0355 1.0814 1.0710 1.0619 1.0685 1.0615 1.0652 1.0967 1.0684 1.0957 1.0999 1.0978 1.0969 1.0959 1.0912 1.0966 1.0868 1.0894 1.0928 1.1004
irintensity: 0.2819 0.1869 0.3404 1.5376 2.8858 3.5138 3.2411 2.9162 1.5422 4.9012 1.0176 4.8355 0.6582 6.9386 6.9160 0.7895 2.5538 3.5871 4.2497 5.4148 3.9042 4.2916 3.8401 2.0549 2.7775 1.9069 3.4449 0.3691 4.3081 3.2335 0.9040 7.2814 5.9712 1.4036 16.2090 59.2589 8.7439 4.3577 5.1701 4.1825 0.3756 13.3715 4.8105 9.5551 1.5027 0.4827 0.1151 11.8818 4.0249 49.9835 34.2997 5.9533 2.7273 24.9486 25.0721 6.3903 20.9886 11.2523 24.0714 5.0488 7.2459 1.3501 0.9757 20.9655 13.1760 6.1512 12.4474 8.4964 48.0830 4.6099 10.9355 76.1135 23.0471 10.1873 21.2799 0.8648 5.5383 31.9559 28.5788 10.0997 7.3516 20.2012 8.7166 69.9297 2.9471 10.9083 5.8062 56.2249 17.2754 76.5555 2.9180 19.1534 2.8545 4.3677 23.7073 369.1352 128.1772 14.9233 6.9117 26.2152 74.2854 71.0748 66.1124 22.5042 40.8758 22.6235 14.8870 90.3288 51.8624 26.6237 41.1397 15.8649 33.2316 8.7171 22.0359 28.2253 11.5926 2.6269 23.3610 32.4311
temp: 298.150 k
press: 1.00000 atm
elementType: 8 8 7 6 6 6 6 6 6 6 6 6 6 6 6 6 6 6 6 6 6 1 1 1 1 1 1 1 1 1 1 1 1 1 1 1 1 1 1 1 1 1
symmnumber: 1
zpe: 921752.7 jmol-1
zpe.correction: 0.351077 hartree
zpe.thermalcorrener: 0.369336 hartree
zpe.thermalcorrenthalpy: 0.370280 hartree
zpe.thermalcorrgfe: 0.304429 hartree
zpe.sumelectzpe: -902.160656 hartree
zpe.sumelectthermal: -902.142397 hartree
zpe.sumelectthermalent: -902.141453 hartree
zpe.sumelectthermalfe: -902.207304 hartree
dipole: -0.9077 -6.3481 2.2260
dipole: 6.7880
quadrupole: -105.0336 -131.2656 -125.5594
quadrupole: -10.6813 5.8084 6.8724
quadrupole: 15.5860 -10.6461 -4.9399 -10.6813 5.8084 6.8724
hfenergy: -902.5117334 hartree
pointgroup: C01 [X(C18H21N1O2)]
dipole: 0.397596 2.4301056 1.0337658 debye
polarizability: 270.6815549|6.563279|211.50177|-1.4412743|-0.5774453|130.9876087 unknown
InChI: InChI=1S/C18H21NO2/c1-21-13-6-7-16-15(10-13)18(20)11-17-14-5-3-2-4-12(14)8-9-19(16)17/h2-5,13,17H,6-11H2,1H3
charge 0 multiplicity 1
42 atoms
O  -4.308406 0.53279 -0.996361
O  -1.291919 -3.137112 -0.784409
N  0.161933 0.59304 0.357042
C  1.080911 -0.581284 0.385645
C  -1.204792 0.328964 0.400633
C  -1.720141 -0.940482 0.107378
C  0.608991 -1.603592 -0.675109
C  -2.136501 1.475105 0.775378
C  0.740599 1.943731 0.486186
C  -3.203757 -1.268072 0.198331
C  -4.120552 -0.048818 0.352744
C  2.550192 -0.216783 0.201085
C  -3.494235 0.977858 1.316472
C  1.900469 2.119506 -0.517767
C  -0.859928 -1.984106 -0.441123
C  2.956698 1.055077 -0.281434
C  3.532369 -1.19915 0.482641
C  4.333737 1.314272 -0.487556
C  4.901206 -0.937209 0.269192
C  5.305775 0.326024 -0.224289
C  -5.409363 1.48985 -1.070543
H  0.955356 -1.071872 1.380572
H  1.225917 -2.517009 -0.640097
H  0.71239 -1.169035 -1.690189
H  -1.666313 2.128203 1.53337
H  -2.321789 2.093919 -0.126539
H  1.120711 2.11829 1.516249
H  -0.041233 2.690342 0.280945
H  -3.498255 -1.830405 -0.705872
H  -3.382822 -1.958929 1.047049
H  -5.113976 -0.374926 0.735728
H  -3.355267 0.491859 2.301863
H  -4.167564 1.841755 1.472007
H  2.338194 3.129209 -0.405673
H  1.492447 2.050192 -1.54564
H  3.221815 -2.176598 0.872483
H  4.642831 2.301812 -0.851966
H  5.647803 -1.707694 0.490228
H  6.367535 0.539427 -0.389715
H  -5.207429 2.42047 -0.497956
H  -6.35856 1.045265 -0.700051
H  -5.519478 1.744019 -2.137033
