program: Gaussian 09
title: 000022619
version: EM64L-G09RevD.01
frameworkgroup: C1[X(C15H26N2)]
method: RPBEPBE
basis: SDD
operation: Freq
keyword: #pfreq=noraman
keyword: PBEPBE/SDD
title: #p freq=noraman PBEPBE/SDD
converged: YES YES NO NO
title: Mulliken charges:
elementType: N N C C C C C C C C C C C C C C C H H H H H H H H H H H H H H H H H H H H H H H H H H
charge: -0.168196 -0.100257 -0.497684 -0.362609 -0.050385 0.441491 -0.324256 -0.316036 -0.682903 -0.694959 -0.672805 -0.676353 -0.366034 -0.344791 -0.241996 -0.252616 -0.275508 0.241954 0.230648 0.226792 0.200621 0.204097 0.203946 0.189681 0.201872 0.190892 0.207118 0.223645 0.225524 0.226360 0.208249 0.233230 0.206243 0.228005 0.207707 0.207732 0.227561 0.207914 0.219601 0.212085 0.215078 0.216039 0.223303
chargesum: 0.00000
title: Mulliken charges with hydrogens summed into heavy atoms:
elementType: N N C C C C C C C C C C C C C C C
charge: -0.168196 -0.100257 -0.025081 0.064803 0.153711 0.441491 0.069372 0.076728 -0.026616 -0.027119 -0.030851 -0.033146 -0.146433 -0.132706 -0.026919 -0.036577 -0.052205
polarizability: 2.19068226e+02 1.45586837e+01 2.00289417e+02 6.08221792e+00 5.51418408e+00 1.23793621e+02
1716.lowfreq: -9.6608 -8.9444 -0.0004 0.0002 0.0006 5.4507 23.5537 27.0881 34.3834
frequency: 23.4575 26.6566 34.0638 52.4172 62.7081 80.9042 92.1163 101.7338 144.3493 152.6366 163.3203 180.9977 202.1376 226.0452 236.9935 256.2155 289.2615 291.2752 316.3462 351.3369 376.2196 414.7278 422.9829 426.5983 452.3723 479.2024 501.1145 524.1646 607.4991 619.6468 693.4821 697.8390 750.4384 753.8505 779.0785 794.1555 797.3114 808.8062 848.3750 862.4169 910.0693 911.3148 933.1418 940.3721 951.0177 970.0323 976.3910 986.3096 1024.4374 1030.3902 1063.2930 1069.9390 1074.1202 1083.2730 1084.7585 1108.9845 1133.2168 1134.6230 1138.1481 1168.7057 1174.4315 1194.8612 1202.9682 1206.7391 1240.1135 1278.8023 1286.4898 1290.5369 1315.3142 1317.3113 1324.2447 1335.0716 1359.9036 1364.9836 1375.1765 1378.9928 1380.5592 1385.0090 1386.6901 1397.2676 1414.3665 1449.1605 1460.3736 1461.6064 1462.1923 1468.4463 1472.1710 1474.2739 1475.2852 1480.5189 1485.0381 1487.6410 1490.4950 1491.8539 1504.8000 1573.7958 1619.6551 2851.9009 2860.3496 2892.4909 2980.3401 2980.5264 2984.1310 2984.9106 2991.7793 2998.1514 3017.3283 3026.8035 3033.4303 3056.7929 3072.2903 3075.3450 3076.2262 3081.5947 3090.2807 3092.1427 3096.9201 3104.3163 3117.9958 3124.6769 3153.3637 3164.3131 3190.3223
redmass: 3.3153 3.4774 3.2643 2.6086 2.7316 2.4299 2.0636 2.2761 2.8213 1.6222 1.3335 1.1671 1.3796 2.4928 1.7358 2.6290 2.2417 2.3520 2.6111 2.6247 2.7367 2.9508 2.8432 3.3232 2.7606 2.6574 2.9722 2.9788 4.0652 4.9178 1.7420 4.1136 2.0391 2.2939 1.2129 1.1671 1.2377 1.2560 2.4811 1.4914 1.5719 1.6158 1.5397 1.8359 1.3476 1.2877 5.3193 2.3660 3.5264 2.2543 1.7424 2.5946 1.8896 2.0969 2.0980 1.8235 2.0531 2.1867 1.9950 1.2222 1.5504 1.9770 1.3972 2.0537 1.6643 1.1406 1.2190 1.2382 1.3890 1.3928 1.3270 1.5245 1.3332 1.3471 2.6232 1.6184 1.3176 1.2318 1.2316 1.2087 1.4526 2.4337 1.0599 1.0513 1.0532 1.0610 1.0504 1.0769 1.0749 1.0739 1.0616 1.1928 1.0737 1.1129 1.9140 5.9615 6.1237 1.0719 1.0714 1.0702 1.0378 1.0755 1.0358 1.0375 1.0410 1.0617 1.0873 1.0892 1.0877 1.1032 1.0983 1.0994 1.0983 1.0993 1.1003 1.1003 1.0989 1.0980 1.0847 1.0897 1.0923 1.0977 1.0922
irintensity: 0.1923 0.1894 0.1639 0.3093 0.5056 0.1629 0.0914 0.2966 0.2286 0.9142 0.0549 0.5762 0.1748 1.5505 0.1643 1.0504 2.5448 0.3565 0.6217 0.4631 0.8647 7.6948 2.3833 8.1660 2.2233 12.4408 1.9732 3.0044 7.3876 5.1910 41.1196 1.1888 49.3567 33.2388 7.7886 3.2532 7.1949 0.5970 0.1479 4.7703 0.7094 0.8667 3.1564 3.9947 0.1250 0.1391 8.4227 4.3060 3.1606 11.8393 8.7631 44.7262 17.7778 0.3001 3.3887 49.7764 18.6944 17.5226 10.2530 20.9821 41.8341 23.5081 1.3789 73.5889 21.6925 9.9761 6.8354 40.9949 28.8344 35.8083 11.8295 44.0877 2.3520 5.1539 4.2940 23.2182 20.7518 20.3332 22.9387 25.6958 6.2714 2.6930 6.0141 0.7227 5.7929 2.0570 2.9504 13.7678 3.4673 7.8271 7.9539 18.7616 15.9356 27.6496 136.6696 10.0845 178.8913 31.3613 142.9459 92.5441 30.2605 15.8321 33.7488 25.8579 31.4716 51.7172 23.2157 9.5176 19.5985 36.4377 61.8467 18.9048 70.0005 54.7203 33.6004 45.7401 15.2538 51.8768 6.8085 16.7405 46.2664 24.5582 15.5907
temp: 298.150 k
press: 1.00000 atm
elementType: 7 7 6 6 6 6 6 6 6 6 6 6 6 6 6 6 6 1 1 1 1 1 1 1 1 1 1 1 1 1 1 1 1 1 1 1 1 1 1 1 1 1 1
symmnumber: 1
zpe: 999800.9 jmol-1
zpe.correction: 0.380804 hartree
zpe.thermalcorrener: 0.400653 hartree
zpe.thermalcorrenthalpy: 0.401597 hartree
zpe.thermalcorrgfe: 0.330757 hartree
zpe.sumelectzpe: -695.317585 hartree
zpe.sumelectthermal: -695.297736 hartree
zpe.sumelectthermalent: -695.296792 hartree
zpe.sumelectthermalfe: -695.367632 hartree
dipole: 1.9033 1.3748 -0.4145
dipole: 2.3842
quadrupole: -104.7176 -99.5524 -111.0339
quadrupole: -4.8089 -1.9405 0.6109
quadrupole: 0.3837 5.5489 -5.9326 -4.8089 -1.9405 0.6109
hfenergy: -695.6983889 hartree
pointgroup: C01 [X(C15H26N2)]
dipole: 0.7728618 -0.4819825 0.2241969 debye
polarizability: 218.2378298|-16.4585731|198.3213659|-10.0154388|-11.4729009|126.5920674 unknown
InChI: InChI=1S/C15H26N2/c1-5-16(6-2)12-13-17(14(3)4)15-10-8-7-9-11-15/h7-11,14H,5-6,12-13H2,1-4H3
charge 0 multiplicity 1
43 atoms
N  -0.755099 -0.78203 -0.093594
N  2.923708 0.29135 -0.240982
C  0.564579 -0.449112 -0.667216
C  1.619456 -0.026645 0.391435
C  -0.913658 -2.197315 0.35537
C  -1.753939 0.205464 0.00968
C  4.094072 -0.083878 0.597079
C  2.985941 1.694577 -0.736092
C  -1.754413 -3.065621 -0.620529
C  -1.357146 -2.340358 1.833686
C  4.35582 -1.602123 0.610762
C  3.986991 1.886964 -1.891088
C  -1.434035 1.591823 -0.172075
C  -3.125166 -0.107002 0.282047
C  -2.425267 2.590335 -0.097026
C  -4.103714 0.903315 0.364995
C  -3.773475 2.264608 0.174939
H  0.962783 -1.331496 -1.202304
H  0.450304 0.343282 -1.429265
H  1.22474 0.82552 0.995865
H  1.757883 -0.8689 1.09448
H  0.114589 -2.608046 0.313986
H  4.984504 0.419392 0.178429
H  3.983219 0.291802 1.646132
H  1.977794 1.967906 -1.101011
H  3.221799 2.408041 0.094553
H  -1.691419 -4.130617 -0.328188
H  -2.819378 -2.780818 -0.633357
H  -1.367755 -2.966242 -1.650777
H  -0.691452 -1.753285 2.4913
H  -1.29769 -3.40266 2.13476
H  -2.388887 -1.996546 2.010025
H  3.503386 -2.163695 1.035342
H  4.524279 -1.96596 -0.417769
H  5.247065 -1.836715 1.222454
H  5.023126 1.656888 -1.58365
H  3.726887 1.222132 -2.732987
H  3.969619 2.934355 -2.246197
H  -0.399842 1.899695 -0.351312
H  -3.441886 -1.143668 0.405115
H  -2.133362 3.63765 -0.241583
H  -5.141961 0.615599 0.570453
H  -4.539703 3.044035 0.236713
