program: Gaussian 09
title: 000293646
version: EM64L-G09RevD.01
frameworkgroup: C1[X(C18H25NO)]
method: RPBEPBE
basis: SDD
operation: Freq
keyword: #p
keyword: freq=noraman
keyword: PBEPBE/SDD
title: #p freq=noraman PBEPBE/SDD
converged: YES YES NO NO
title: Mulliken charges:
elementType: O N C C C C C C C C C C C C C C C C C C H H H H H H H H H H H H H H H H H H H H H H H H H
charge: -0.256597 -0.098583 0.229546 -0.483155 -0.007229 -0.149889 0.135117 -0.720094 -0.723000 -0.611179 -0.503706 -0.717405 0.509978 -0.002503 -0.400261 -0.418429 -0.232034 -0.234477 -0.613783 -0.248805 0.227175 0.209234 0.215800 0.263238 0.206638 0.213935 0.237123 0.217811 0.199678 0.231318 0.229817 0.209767 0.201677 0.226790 0.232949 0.236180 0.206908 0.217986 0.228621 0.236994 0.221488 0.222683 0.212890 0.214567 0.225223
chargesum: 0.00000
title: Mulliken charges with hydrogens summed into heavy atoms:
elementType: O N C C C C C C C C C C C C C C C C C C
charge: -0.256597 -0.098583 0.229546 -0.046746 0.208572 0.113349 0.135117 -0.062397 -0.074193 -0.171595 -0.075240 -0.041368 0.509978 0.215483 -0.171640 -0.181435 -0.010546 -0.011794 -0.186326 -0.023582
polarizability: 2.08245229e+02 -1.80233487e+01 2.12448167e+02 1.33566922e+01 1.64155098e+01 1.71416854e+02
1716.lowfreq: -15.8784 -10.2051 -0.0007 -0.0006 0.0006 6.3865 14.3587 21.7284 41.2066
frequency: 13.3899 20.0955 41.0607 43.9582 52.7831 79.9841 85.5873 102.7420 136.3250 143.8672 162.3608 181.3202 204.5104 214.8220 237.5321 255.0250 262.0869 307.8428 321.5281 325.0891 343.5400 383.8897 404.1168 408.0489 433.0512 451.3394 483.9342 490.6228 508.6217 526.9229 577.8116 597.0674 616.7586 636.2457 702.3018 705.6447 759.4681 775.1319 791.0296 806.3229 823.0887 852.5445 873.2574 884.0806 901.7063 918.5696 923.8833 932.7325 936.3191 941.1853 969.4284 974.4278 990.0684 991.3302 992.8917 995.2477 1006.7991 1020.3713 1026.9065 1036.3908 1038.7784 1082.5770 1083.7316 1116.5015 1126.1836 1143.5293 1169.0045 1172.0813 1176.3871 1186.6994 1203.4258 1214.7160 1216.4509 1228.9968 1254.0700 1259.8466 1284.1724 1295.9999 1305.3465 1309.6812 1319.4076 1332.3254 1357.4028 1364.2148 1373.3414 1382.5871 1390.6554 1394.0866 1425.7488 1438.9159 1440.0089 1454.4498 1454.6858 1461.3031 1466.3981 1470.1120 1471.0108 1477.4555 1482.3154 1485.8233 1591.7991 1613.3295 1630.0704 1658.5873 2971.7318 2977.8037 2978.9246 2983.0868 2985.4373 2988.6449 2990.7692 3022.9738 3038.6837 3050.8183 3057.5263 3073.6184 3076.8805 3078.9134 3086.5075 3088.9982 3090.4238 3092.4120 3099.1724 3111.7387 3116.9304 3131.0176 3140.9266 3159.2688 3191.7666
redmass: 3.9341 4.1173 3.6768 3.9934 3.4013 3.3785 2.9392 3.3496 2.5788 3.3152 2.5586 3.0716 1.1234 1.1086 1.2930 2.9321 2.1208 2.4216 2.6837 2.7518 2.1738 2.8602 2.8201 2.6140 2.5237 3.9989 3.1999 2.8082 2.8521 3.0630 4.0528 2.7381 6.3603 2.0005 3.9174 1.7374 2.0028 3.3508 4.3519 3.7838 3.1006 1.2517 1.6923 1.7525 2.1688 1.5490 1.6930 1.5870 1.7782 1.4940 1.6496 1.3945 5.3819 1.3666 1.4210 1.3019 1.5310 2.6760 2.2415 1.8116 3.6970 2.0047 1.7451 2.6686 1.7060 1.8461 1.1763 1.2141 1.9099 1.1259 2.8674 1.4466 2.4379 2.1868 1.2375 1.9110 1.2190 1.5037 1.3168 1.3524 1.2440 1.2742 1.5672 1.6473 1.2216 6.4039 1.2175 1.2501 1.1767 1.3673 1.5030 1.0874 1.0818 1.0472 1.0518 1.1151 1.0802 1.0495 2.2489 1.0524 6.0276 6.1371 10.0272 4.7252 1.0591 1.0412 1.0561 1.0509 1.0608 1.0578 1.0433 1.0874 1.0989 1.1028 1.0990 1.0999 1.0703 1.0989 1.0997 1.0992 1.0834 1.0992 1.1006 1.0865 1.0860 1.0913 1.0961 1.1014 1.1142
irintensity: 0.5036 0.0185 0.0894 0.0094 0.2688 0.4169 0.3220 1.1928 0.0808 1.0012 0.3283 0.8725 0.1598 0.2014 0.7164 0.6610 0.1599 0.9729 0.9538 2.1197 0.5828 0.6182 0.0062 1.1453 1.0356 5.9462 0.8288 7.0452 7.8868 15.7363 4.8194 0.7869 0.2710 18.4603 4.7654 57.9525 42.7421 0.4193 7.2180 5.4030 7.5348 0.5307 7.5532 8.8333 2.3930 1.9952 2.1528 2.0298 20.3343 59.7837 3.9970 0.3020 0.1830 1.5582 8.0240 1.1307 36.9645 0.0330 5.2660 51.0935 30.7637 16.5914 9.9441 70.9035 2.1901 27.8933 0.2614 0.7211 23.6564 0.7228 15.3731 1.3492 0.0286 41.6056 2.9127 26.4427 1.0880 17.4467 1.4088 4.9806 4.2694 1.2784 22.6384 5.4002 18.8838 0.1898 16.9805 19.9473 4.8987 1.9350 8.2097 3.2212 8.2621 11.4194 7.6703 24.3677 1.0220 10.8007 15.0503 14.1388 1.1486 9.3877 141.2403 19.6652 18.3085 14.3358 15.8984 42.6254 40.7730 22.2702 36.3375 7.0719 7.7059 21.3631 22.7717 20.2036 40.0824 59.6584 4.6415 36.7850 8.8618 43.6901 27.2047 8.9541 1.5667 15.8161 46.5778 23.7652 29.1671
temp: 298.150 k
press: 1.00000 atm
elementType: 8 7 6 6 6 6 6 6 6 6 6 6 6 6 6 6 6 6 6 6 1 1 1 1 1 1 1 1 1 1 1 1 1 1 1 1 1 1 1 1 1 1 1 1 1
symmnumber: 1
zpe: 1010690.1 jmol-1
zpe.correction: 0.384952 hartree
zpe.thermalcorrener: 0.406009 hartree
zpe.thermalcorrenthalpy: 0.406953 hartree
zpe.thermalcorrgfe: 0.333008 hartree
zpe.sumelectzpe: -829.350331 hartree
zpe.sumelectthermal: -829.329274 hartree
zpe.sumelectthermalent: -829.328329 hartree
zpe.sumelectthermalfe: -829.402274 hartree
dipole: -0.2983 -1.9740 1.1051
dipole: 2.2818
quadrupole: -121.1386 -110.9423 -122.4445
quadrupole: 2.8901 0.3168 -0.7829
quadrupole: -2.9635 7.2328 -4.2694 2.8901 0.3168 -0.7829
hfenergy: -829.7352829 hartree
pointgroup: C01 [X(C18H25N1O1)]
dipole: 0.2276905 0.7865498 0.3680219 debye
polarizability: 203.5328288|-17.3764091|214.8421028|-13.2975166|-18.7780455|173.7353182 unknown
InChI: InChI=1S/C18H25NO/c1-5-9-16(12-15-10-7-6-8-11-15)17-19-18(3,4)13-14(2)20-17/h5-8,10-11,14,16H,1,9,12-13H2,2-4H3
charge 0 multiplicity 1
45 atoms
O  0.741446 0.252511 1.340457
N  1.454903 0.252547 -0.987091
C  2.005404 1.644725 -0.905547
C  1.366732 2.417518 0.285584
C  1.387217 1.586157 1.57962
C  0.246414 -1.676767 -0.029756
C  0.885492 -0.295335 0.043986
C  3.547682 1.545366 -0.768047
C  1.654092 2.342234 -2.239744
C  -0.937089 -1.674964 -1.050906
C  1.299751 -2.754617 -0.435196
C  0.625039 2.218621 2.74315
C  -2.057262 -0.717002 -0.67427
C  2.432424 -2.897581 0.557403
C  -2.977346 -1.049715 0.354236
C  -2.193676 0.53903 -1.319367
C  -4.002607 -0.154455 0.730702
C  -3.218401 1.439622 -0.946707
C  2.765468 -4.042807 1.204169
C  -4.12647 1.096661 0.08132
H  0.312676 2.652635 0.038725
H  1.896091 3.373669 0.458037
H  2.43246 1.368988 1.879612
H  -0.143108 -1.909553 0.978453
H  4.009881 2.547506 -0.839484
H  3.845792 1.089379 0.193315
H  3.952714 0.913696 -1.577819
H  0.558583 2.391822 -2.375532
H  2.058201 3.371318 -2.264748
H  2.076814 1.771716 -3.0849
H  -0.523161 -1.414142 -2.042279
H  -1.327173 -2.710319 -1.109692
H  0.785426 -3.727343 -0.55895
H  1.705198 -2.457514 -1.423773
H  -0.425792 2.403528 2.45927
H  0.634128 1.550338 3.62123
H  1.090742 3.179859 3.028002
H  3.022844 -1.986802 0.743869
H  -2.889224 -2.019195 0.861348
H  -1.49218 0.804242 -2.119813
H  -4.705832 -0.430983 1.524816
H  -3.312576 2.403066 -1.461549
H  3.604013 -4.083864 1.908682
H  2.207508 -4.974738 1.04595
H  -4.924038 1.791237 0.368836
