program: Gaussian 09
title: 000293628
version: EM64L-G09RevD.01
frameworkgroup: C1[X(C13H12INO2S)]
method: RPBEPBE
basis: SDD
operation: Freq
keyword: #p
keyword: freq=noraman
keyword: PBEPBE/SDD
title: #p freq=noraman PBEPBE/SDD
converged: YES YES NO NO
title: Mulliken charges:
elementType: I S O O N C C C C C C C C C C C C C H H H H H H H H H H H H
charge: 0.111025 0.955324 -0.526117 -0.514520 -0.541642 -0.088327 -0.261983 -0.211310 0.374967 0.449124 -0.366328 -0.358860 -0.316201 -0.364181 -0.796908 -0.147876 -0.126089 -0.366826 0.288626 0.286911 0.282910 0.246419 0.246761 0.298541 0.232891 0.232686 0.246180 0.229853 0.254336 0.250613
chargesum: 0.00000
title: Mulliken charges with hydrogens summed into heavy atoms:
elementType: I S O O N C C C C C C C C C C C C C
charge: 0.111025 0.955324 -0.526117 -0.514520 -0.253015 -0.088327 0.024928 0.071600 0.374967 0.449124 -0.119908 -0.112100 -0.017661 -0.131290 -0.088189 0.106460 0.124524 -0.366826
polarizability: 3.01461941e+02 -2.39649012e+01 1.99327432e+02 2.38328757e+01 5.93266926e+00 1.51534128e+02
1716.lowfreq: -35.7413 -4.7733 -0.0009 0.0010 0.0012 2.4254 6.1053 13.0183 24.3697
frequency: -35.5016 12.5463 24.2840 42.7719 55.2572 77.4625 102.7834 125.3586 151.8968 172.0083 176.2050 224.8274 244.3960 257.0300 279.8160 298.4552 341.1483 374.9269 394.2762 406.6032 408.0461 426.1989 440.8460 502.4582 512.0689 579.3375 594.0997 620.6168 621.7001 703.0528 705.4689 770.7237 779.5427 809.0882 813.3941 821.3673 826.8064 838.9071 848.4819 945.5729 956.7314 961.5266 968.4670 981.2872 985.4786 990.0524 991.0722 1047.6083 1049.5595 1051.8847 1106.2219 1119.3174 1184.5631 1185.3571 1218.0951 1226.7447 1243.4981 1296.8928 1298.8101 1372.9042 1379.8912 1390.9620 1399.3232 1403.5915 1462.8158 1470.5542 1470.7512 1472.5864 1561.0690 1582.4224 1591.5362 1592.6932 2981.4305 3064.1703 3093.5402 3127.5846 3136.8842 3139.4368 3159.5546 3160.1140 3167.9398 3168.5352 3180.2039 3398.9083
redmass: 1.0233 6.5386 4.3910 3.9054 6.7409 6.6651 5.7780 6.4733 9.3954 6.9871 11.2440 8.5938 5.9951 8.9195 5.3071 4.4955 5.7840 3.8859 6.4127 3.0761 2.9196 3.4102 5.1723 3.0729 3.0059 5.9352 7.1002 6.9154 6.4011 3.2648 3.3408 2.3057 2.7679 2.4242 2.7979 2.0506 1.6572 1.6289 1.2450 1.4124 4.2382 1.3078 1.5369 1.4277 5.1711 1.6828 3.6329 2.4496 1.6009 2.4712 1.4096 1.2884 1.1355 1.1396 3.0139 1.2767 3.2250 1.2640 1.3076 4.7967 5.6225 3.1263 1.2216 2.8247 2.3196 1.4304 1.5581 1.0633 6.8998 6.0128 6.7369 6.0517 1.0390 1.0948 1.1001 1.0898 1.0887 1.0897 1.0962 1.0894 1.0954 1.0961 1.0974 1.0758
irintensity: 0.4469 1.0466 0.2623 0.3759 0.2527 5.9472 0.8831 1.0660 0.0978 10.1242 0.8007 6.3523 2.2113 13.0781 4.3883 0.9411 1.8419 3.7587 12.0481 4.8522 1.2328 6.3163 137.2039 76.0940 31.4542 24.8732 25.7592 0.0763 4.1867 1.9459 3.7307 25.3261 26.2167 27.6604 121.9547 75.2730 24.7260 42.6333 1.0851 2.3254 44.3314 2.1146 4.0667 0.5724 53.1220 2.1595 1.9413 25.6430 23.3711 24.5637 10.3241 7.4345 8.3480 7.2264 7.5663 0.1430 19.7521 2.5471 1.5874 1.7926 0.2077 10.2772 16.7595 12.5684 101.9311 13.7807 23.8085 14.3098 1.0030 14.6059 1.4685 10.9594 21.0789 15.4858 14.0090 7.5040 11.0472 5.9908 6.4114 3.2148 4.7318 4.8024 0.7724 16.2789
temp: 298.150 k
press: 1.00000 atm
elementType: 53 16 8 8 7 6 6 6 6 6 6 6 6 6 6 6 6 6 1 1 1 1 1 1 1 1 1 1 1 1
symmnumber: 1
zpe: 568958.3 jmol-1
zpe.correction: 0.216705 hartree
zpe.thermalcorrener: 0.234137 hartree
zpe.thermalcorrenthalpy: 0.235081 hartree
zpe.thermalcorrgfe: 0.167368 hartree
zpe.sumelectzpe: -1115.884761 hartree
zpe.sumelectthermal: -1115.867329 hartree
zpe.sumelectthermalent: -1115.866384 hartree
zpe.sumelectthermalfe: -1115.934098 hartree
dipole: -0.1085 6.5545 2.5219
dipole: 7.0238
quadrupole: -135.3782 -131.5596 -121.5244
quadrupole: 23.8793 9.8752 -3.2045
quadrupole: -5.8908 -2.0722 7.9630 23.8793 9.8752 -3.2045
hfenergy: -1116.1014654 hartree
pointgroup: C01 [X(C13H12I1N1O2S1)]
dipole: -0.6466949 2.5146484 -0.9457896 debye
polarizability: 277.586532|46.8883389|220.4111369|31.7985071|5.3488229|154.3258322 unknown
InChI: InChI=1S/C13H12INO2S/c1-10-2-8-13(9-3-10)18(16,17)15-12-6-4-11(14)5-7-12/h2-9,15H,1H3
charge 0 multiplicity 1
30 atoms
I  5.176968 2.174405 0.464675
S  -0.970478 -2.145068 0.235945
O  -1.952292 -3.163577 -0.561487
O  -0.458211 -2.396962 1.753857
N  0.643021 -2.136932 -0.859541
C  -1.732418 -0.415697 0.168571
C  -2.705345 -0.165021 -0.813277
C  -1.301242 0.545794 1.097781
C  1.610232 -1.141509 -0.570323
C  -2.865567 2.142063 0.04912
C  -3.270191 1.128316 -0.860751
C  -1.878793 1.832184 1.023137
C  2.284122 -1.179547 0.684144
C  1.960839 -0.139477 -1.519332
C  -3.500808 3.519219 0.0058
C  3.282238 -0.230884 0.98146
C  2.988392 0.785689 -1.239646
C  3.634101 0.742448 0.016342
H  0.282937 -2.136512 -1.830475
H  -3.026943 -0.961141 -1.492934
H  -0.558909 0.292234 1.860823
H  -4.037958 1.351043 -1.61042
H  -1.560316 2.603053 1.733971
H  2.023008 -1.958343 1.406339
H  1.439908 -0.09018 -2.483533
H  -2.786905 4.305148 0.307537
H  -4.361891 3.574932 0.699581
H  -3.87569 3.763355 -1.002913
H  3.79336 -0.266813 1.947668
H  3.265328 1.536583 -1.985018
