program: Gaussian 09
title: 000024029
version: EM64L-G09RevD.01
frameworkgroup: C1[X(C22H27NO4)]
method: RPBEPBE
basis: SDD
operation: Freq
keyword: #p
keyword: freq=noraman
keyword: PBEPBE/SDD
title: #p freq=noraman PBEPBE/SDD
converged: YES YES NO NO
title: Mulliken charges:
elementType: O O O O N C C C C C C C C C C C C C C C C C C C C C C H H H H H H H H H H H H H H H H H H H H H H H H H H H
charge: -0.288632 -0.250189 -0.264821 -0.265761 -0.333286 -0.043997 -0.151624 -0.415020 -0.419830 -0.365833 -0.029278 -0.351627 -0.418779 0.444944 0.330213 -0.373502 -0.346487 -0.343291 -0.368149 -0.376660 -0.359158 -0.363272 -0.361397 0.323966 0.317177 -0.537716 -0.537739 0.211050 0.244624 0.204480 0.201879 0.214498 0.193992 0.236105 0.209222 0.278738 0.188187 0.206105 0.168781 0.211365 0.252731 0.271934 0.250238 0.252544 0.248515 0.251066 0.237841 0.240856 0.221289 0.244062 0.221557 0.246004 0.221824 0.220261
chargesum: 0.00000
title: Mulliken charges with hydrogens summed into heavy atoms:
elementType: O O O O N C C C C C C C C C C C C C C C C C C C C C C
charge: -0.288632 -0.250189 -0.264821 -0.265761 -0.054548 0.167053 0.093000 -0.008661 -0.011340 0.079494 -0.029278 0.042666 -0.038634 0.444944 0.330213 -0.120771 -0.074553 -0.093054 -0.115605 -0.128145 -0.108092 -0.125431 -0.120541 0.323966 0.317177 0.149193 0.150350
polarizability: 3.12213881e+02 2.56490238e+01 2.70905424e+02 9.67924783e-01 -9.78107277e+00 1.98289784e+02
1716.lowfreq: -4.0984 -1.5060 -0.0008 -0.0006 0.0001 6.2443 15.6626 16.5164 30.1046
frequency: 15.0776 16.4667 30.0344 36.2614 47.0166 48.2677 81.0638 90.3544 100.9482 113.8943 131.4726 153.1578 170.9658 182.3679 194.3626 221.6628 234.2060 235.6836 249.2488 259.2095 286.2954 301.2209 305.4098 320.3639 358.4923 384.0154 405.1931 412.7622 416.2053 431.7212 440.8659 457.1757 469.5372 479.6281 490.6895 531.6558 545.4164 549.3152 567.0693 590.6044 626.9253 630.1967 670.5967 702.1710 709.3977 729.6054 735.8652 766.8537 776.8216 809.2151 809.9992 820.6334 823.5986 835.8582 839.9525 844.5805 871.9439 882.0732 916.5945 922.8136 928.0636 944.8875 950.3945 960.9600 966.1285 977.3169 980.0992 985.9414 988.0798 991.8173 1000.5843 1008.9651 1018.7056 1050.4028 1075.4972 1091.8479 1101.6433 1110.6543 1111.6701 1112.4704 1116.0512 1136.8128 1145.8079 1155.7854 1157.0786 1159.2981 1172.2904 1174.5441 1188.7467 1205.3871 1214.6598 1226.8980 1230.9901 1241.9126 1265.6076 1267.0010 1274.0774 1284.9086 1296.2723 1302.9598 1303.5473 1329.8980 1335.6057 1337.9471 1343.2282 1362.5321 1371.5535 1372.7552 1378.1328 1413.5464 1416.7147 1435.1727 1436.9866 1446.0944 1455.0892 1457.8418 1466.0319 1466.4635 1466.9186 1467.2140 1473.1412 1473.5594 1475.7429 1496.6921 1503.2078 1581.0803 1586.7775 1620.2719 1622.0975 2833.4878 2840.6782 2958.9799 2959.3961 2965.9532 2973.7132 2979.1402 2986.9083 3019.1134 3028.0509 3033.1519 3038.4510 3046.4478 3047.2712 3054.1623 3101.8328 3123.6653 3124.7459 3140.6172 3145.2272 3147.6685 3148.5891 3162.1608 3167.9058 3168.8892 3171.9278 3448.2911
redmass: 3.9690 4.1507 3.9654 4.7005 3.8302 3.2655 3.8379 3.7110 3.5548 4.1575 3.4748 4.5620 3.2165 3.6533 3.3709 2.0861 1.6470 1.4021 1.8736 4.3659 3.5360 3.4222 2.9683 4.2496 5.1337 4.1069 4.6967 2.9498 2.9965 2.8304 3.2090 4.3364 3.5963 3.8210 3.7014 3.0859 2.8560 1.6052 4.6381 5.1633 7.0332 7.0703 3.6116 2.7619 2.3954 3.7443 4.2544 5.7123 6.0409 1.6495 1.8410 1.3787 1.6107 2.0039 1.5288 2.0942 2.3603 3.2468 2.3883 2.0745 4.2045 2.0177 2.0943 1.7817 1.3824 2.3057 1.8115 5.0858 8.5775 3.5801 2.1292 2.4487 2.4519 2.4488 1.7670 1.8838 1.8904 1.3263 1.2643 1.2602 1.3534 2.3411 2.3172 1.3305 1.3320 1.5292 1.3150 1.3332 1.5886 1.7614 1.6682 3.3993 3.0379 1.2668 1.2257 2.6872 1.5199 1.2321 1.2767 1.2973 1.2645 1.2398 1.2862 1.3653 1.4861 1.6396 1.8904 2.6882 6.2007 3.9433 3.8474 1.1723 1.1791 1.1812 1.2243 1.0897 1.0505 1.0899 1.0501 1.0927 1.0719 1.0810 1.0908 2.4095 2.5294 7.4678 7.4793 6.4398 6.4286 1.0751 1.0758 1.0330 1.0329 1.0612 1.0611 1.0666 1.0613 1.0864 1.0946 1.0903 1.1022 1.1038 1.1039 1.1037 1.0990 1.0994 1.0993 1.0876 1.0881 1.0878 1.0872 1.0952 1.0958 1.0967 1.0967 1.0747
irintensity: 0.7408 0.5903 1.2176 0.7564 0.3663 0.4105 2.9931 1.0206 1.5225 1.2386 4.8278 3.1100 1.2647 1.0013 2.2894 1.4081 1.5775 0.9552 3.6867 6.1919 1.6276 3.8074 8.4386 0.6671 0.3770 0.7226 0.5055 0.3878 0.6981 2.7804 6.0081 1.8792 0.4097 5.1236 5.0749 9.6000 4.1855 18.0645 61.7269 29.3854 2.0413 0.5442 5.7820 50.2474 40.2475 3.4154 0.1321 0.7454 1.1776 31.3439 28.1047 29.7237 76.4056 10.1875 78.0312 29.0509 31.3696 11.5004 1.4330 1.8146 57.9895 3.4714 6.8269 64.4086 7.8235 7.3965 7.4998 100.2512 42.9946 60.2923 12.8738 10.5033 73.9943 18.2891 8.5819 3.1233 6.2497 7.5550 0.6998 0.1780 3.9710 22.7105 2.2888 3.2773 1.6651 2.3070 120.6469 152.3860 8.4256 15.4445 4.0620 187.5497 118.0490 0.3818 2.6260 176.6343 42.0243 4.1745 0.5848 4.5028 38.3635 8.3072 1.5302 1.2353 2.3832 5.7852 6.5009 9.4990 19.6559 3.9071 2.4039 9.1607 8.4263 24.6668 2.8747 12.2721 12.2597 1.4140 12.9248 13.1422 82.3317 30.7798 4.9717 52.0961 105.7955 15.8507 12.4361 89.4972 98.8531 52.5295 129.7649 82.5396 58.3541 39.3097 26.5313 51.4460 38.0153 27.1459 67.9077 36.5502 65.6225 46.7402 48.3096 73.9651 29.3694 29.2628 27.9227 4.7548 3.8622 5.1547 9.3251 12.9251 16.5936 5.4930 2.8834 2.3928
temp: 298.150 k
press: 1.00000 atm
elementType: 8 8 8 8 7 6 6 6 6 6 6 6 6 6 6 6 6 6 6 6 6 6 6 6 6 6 6 1 1 1 1 1 1 1 1 1 1 1 1 1 1 1 1 1 1 1 1 1 1 1 1 1 1 1
symmnumber: 1
zpe: 1174532.8 jmol-1
zpe.correction: 0.447356 hartree
zpe.thermalcorrener: 0.472622 hartree
zpe.thermalcorrenthalpy: 0.473566 hartree
zpe.thermalcorrgfe: 0.389793 hartree
zpe.sumelectzpe: -1208.124226 hartree
zpe.sumelectthermal: -1208.098960 hartree
zpe.sumelectthermalent: -1208.098016 hartree
zpe.sumelectthermalfe: -1208.181789 hartree
dipole: 1.7267 -0.2919 -1.1111
dipole: 2.0739
quadrupole: -139.1474 -149.8694 -157.0547
quadrupole: 16.5632 -2.8663 -11.3344
quadrupole: 9.5431 -1.1789 -8.3642 16.5632 -2.8663 -11.3344
hfenergy: -1208.5715816 hartree
pointgroup: C01 [X(C22H27N1O4)]
dipole: 0.6491244 -0.2347599 0.4350657 debye
polarizability: 273.4227519|-29.9370192|304.6652213|-6.9442161|-21.0449882|203.3211153 unknown
InChI: InChI=1S/C22H27NO4/c1-24-18-10-6-16(7-11-18)22(17-8-12-19(25-2)13-9-17)26-15-21(27-22)20-5-3-4-14-23-20/h6-13,20-21,23H,3-5,14-15H2,1-2H3
charge 0 multiplicity 1
54 atoms
O  0.866709 1.11699 -0.013513
O  -0.059802 0.673382 -2.114672
O  -4.808805 3.980489 0.565861
O  -1.179298 -5.008235 0.660989
N  3.529547 0.674157 0.953733
C  3.099441 0.052615 -0.317003
C  2.018945 0.937906 -0.955814
C  4.330407 -0.100273 -1.244356
C  5.447809 -0.906907 -0.53894
C  1.373178 0.339236 -2.233725
C  -0.35256 0.546575 -0.664769
C  5.805636 -0.277388 0.828732
C  4.535368 -0.117779 1.691931
C  -1.536993 1.444362 -0.340755
C  -0.525595 -0.927641 -0.286204
C  -2.707239 0.964552 0.296704
C  -1.157815 -1.821817 -1.189692
C  -1.460955 2.814873 -0.68216
C  -0.113236 -1.413662 0.973429
C  -3.777223 1.832079 0.584126
C  -1.357305 -3.170578 -0.847302
C  -2.523086 3.698236 -0.40354
C  -0.309138 -2.765763 1.336609
C  -3.689188 3.201342 0.234779
C  -0.933259 -3.647759 0.419324
C  -4.768369 5.404439 0.22537
C  -0.765265 -5.551877 1.956371
H  2.657711 -0.966008 -0.155918
H  2.431366 1.950047 -1.124726
H  4.707223 0.910602 -1.498787
H  4.038166 -0.603598 -2.187134
H  6.343944 -0.962592 -1.185972
H  5.099943 -1.949225 -0.381569
H  1.729648 0.797412 -3.168252
H  1.510038 -0.76045 -2.26905
H  2.715458 0.938282 1.524735
H  6.547005 -0.903188 1.362001
H  6.254092 0.722431 0.671399
H  4.161471 -1.140409 1.961497
H  4.776044 0.407257 2.634813
H  -2.786124 -0.092096 0.570908
H  -1.480571 -1.447622 -2.166859
H  -0.555609 3.186653 -1.171282
H  0.371071 -0.724906 1.673845
H  -4.686467 1.473534 1.075757
H  -1.837208 -3.871054 -1.537571
H  -2.435363 4.752991 -0.680723
H  0.023373 -3.112301 2.319703
H  -3.939241 5.920499 0.747663
H  -5.731672 5.809024 0.569191
H  -4.669058 5.555384 -0.867258
H  -1.049765 -6.613862 1.926009
H  -1.290494 -5.048802 2.791604
H  0.329412 -5.462958 2.099862
