program: Gaussian 09
title: 000293577
version: EM64L-G09RevD.01
frameworkgroup: C1[X(C8H9NO2)]
method: RPBEPBE
basis: SDD
operation: Freq
keyword: #pfreq=noraman
keyword: PBEPBE/SDD
title: #p freq=noraman PBEPBE/SDD
converged: NO YES NO NO
title: Mulliken charges:
elementType: O O N C C C C C C C C H H H H H H H H H
charge: -0.272737 -0.388873 0.002396 0.481295 0.350704 -0.523473 -0.385508 -0.365312 -0.204076 -0.365921 -0.536446 0.248266 0.273376 0.244480 0.226528 0.203233 0.222436 0.222456 0.245975 0.321201
chargesum: 0.00000
title: Mulliken charges with hydrogens summed into heavy atoms:
elementType: O O N C C C C C C C C
charge: -0.272737 -0.067671 0.002396 0.481295 0.350704 -0.275207 -0.112132 -0.120832 0.022452 -0.162688 0.154421
polarizability: 1.82113138e+02 4.92572166e+00 1.04662812e+02 -4.53551290e-03 -1.20143640e-02 4.49668779e+01
1716.lowfreq: -5.9071 -4.2451 -0.0005 -0.0004 0.0005 10.8272 66.2339 113.5947 119.1363
frequency: 66.2263 113.5864 119.1361 153.9034 205.0748 242.5275 265.8259 307.2906 320.6291 394.5904 450.4689 463.0045 474.4310 550.0753 598.7650 644.8480 694.6566 759.6092 793.7886 875.9200 891.1320 906.8076 908.4749 932.0844 980.4037 982.9800 1015.0146 1090.5139 1112.6384 1151.0694 1163.4551 1190.5879 1257.0732 1279.9041 1305.3885 1384.9982 1397.4676 1422.3068 1440.0075 1468.0113 1474.2347 1480.8601 1543.7902 1588.1310 1618.6672 2960.4752 2965.8448 3048.0349 3126.9579 3137.8342 3145.0720 3164.3980 3176.9171 3273.9502
redmass: 4.0035 3.7289 5.5103 2.7609 1.7686 3.5343 1.6487 4.4098 6.4186 4.8517 2.4177 1.3944 5.2348 4.6323 4.3007 6.4373 1.9360 6.1669 1.4865 1.5122 1.3891 9.3561 4.1061 1.5816 6.0065 1.3263 3.8783 1.6040 1.2601 1.4179 1.3647 1.2921 1.9832 1.6181 1.3434 1.8755 4.3629 2.4652 1.3442 1.0498 1.0671 2.6069 5.3878 6.1605 6.4363 1.0330 1.0871 1.1039 1.0993 1.0874 1.0917 1.0923 1.0978 1.0653
irintensity: 0.1168 26.6233 10.1471 42.1685 0.2751 6.6956 0.2308 0.2921 4.2624 19.8201 1.6240 100.2517 4.7665 7.0049 0.9827 5.3706 33.5324 40.1754 45.6450 8.3530 0.4143 166.5602 10.1664 53.0268 0.4827 1.9469 42.5466 9.1941 0.2150 12.1284 43.8107 14.9668 121.7545 19.9974 2.4284 26.5902 34.4943 57.1308 10.3806 13.6437 27.9032 37.8234 11.2535 57.8980 55.4589 66.9513 49.8142 48.8656 25.4292 10.4254 3.9993 8.6879 7.8241 15.4029
temp: 298.150 k
press: 1.00000 atm
elementType: 8 8 7 6 6 6 6 6 6 6 6 1 1 1 1 1 1 1 1 1
symmnumber: 1
zpe: 403619.1 jmol-1
zpe.correction: 0.153730 hartree
zpe.thermalcorrener: 0.164157 hartree
zpe.thermalcorrenthalpy: 0.165101 hartree
zpe.thermalcorrgfe: 0.117692 hartree
zpe.sumelectzpe: -514.561276 hartree
zpe.sumelectthermal: -514.550850 hartree
zpe.sumelectthermalent: -514.549906 hartree
zpe.sumelectthermalfe: -514.597315 hartree
dipole: 3.9746 -1.5356 0.0082
dipole: 4.2610
quadrupole: -62.6393 -56.9583 -68.3549
quadrupole: 12.7276 -0.0211 -0.0084
quadrupole: 0.0115 5.6926 -5.7041 12.7276 -0.0211 -0.0084
hfenergy: -514.7150067 hartree
pointgroup: C01 [X(C8H9N1O2)]
dipole: 1.5692015 -0.5894664 0.02103 debye
dipolederiv: -1.5472141 0.3907643 -0.0161164 0.6304765 -0.5300456 0.0074622 -0.0099446 0.0023372 -0.3046163 -1.1278538 -0.1515857 -0.0193982 -0.934695 -0.0772329 -0.0124118 -0.0380882 0.0043428 -0.3913425 0.8084339 0.0750776 0.0217682 0.6664279 0.0066842 0.0180303 0.0358425 0.0051807 -0.1480265 0.1874405 -0.0552044 0.0013464 -0.0156291 0.1238019 0.0018381 0.0026474 0.0011244 0.0457049 1.1756857 -0.5309432 0.0083896 -0.9130559 0.4186891 -0.0115302 -0.0018192 -0.0033051 0.1180863 -0.4098155 0.2460019 0.0023339 -0.078089 0.0049032 0.0039983 -0.0062018 0.0108245 -0.2092454 -0.1902959 -0.1238937 -0.0036078 -0.0459264 -0.1824983 -0.001169 -0.0015269 -0.0029099 -0.1739322 -0.1982882 -0.0267646 -0.0001344 0.3197945 -0.220615 0.0068892 0.0090188 -0.0005333 -0.22176 0.1309774 0.089083 0.0079088 -0.0143008 0.1913693 0.0081575 0.0051711 0.0102823 -0.1272991 0.1020802 0.0200185 0.0050563 0.4274699 0.3872299 0.0208796 0.014916 0.0123667 -0.0942302 0.8800529 -0.0828108 0.0095653 0.2112757 0.1925202 0.0009064 0.017481 -0.0053988 0.3282427 0.1004803 -0.0343235 -0.002435 -0.0217035 -0.0591976 -0.0065802 -0.002053 -0.0067644 0.1729288 0.0261947 0.0775316 -0.0010066 0.0502801 0.0619915 -0.0018321 -0.0016979 -0.0012024 0.1708089 -0.0802944 -0.0643256 -0.0071328 -0.0702141 0.0820423 -0.0039218 -0.0072518 -0.0038074 0.1726415 0.0693244 -0.0269966 -0.0024717 -0.0304346 -0.1198857 -0.0078335 -0.0025518 -0.0077416 0.1514631 -0.0339848 -0.044613 -0.0057714 -0.0718681 -0.1812258 -0.0106528 -0.0065239 -0.0100427 0.1887043 -0.0221486 0.0158942 0.0016492 -0.1476074 0.0281702 -0.1238665 -0.0608667 -0.0896805 -0.0966349 -0.0247592 0.0118486 0.0020416 -0.1560483 0.0167664 0.1232532 0.0557468 0.0962077 -0.0826857 -0.0420294 0.092015 -0.00115 0.1518678 -0.0356085 -0.0009151 0.0004174 -0.002204 0.1241732 0.1960137 0.1232263 -0.0008351 0.0419799 -0.1078588 -0.0107017 -0.0027151 -0.0090761 0.3770189 unknown
polarizability: 181.9472032|5.6091377|104.7206307|3.0461991|1.6750315|45.0749946 unknown
InChI: InChI=1S/C8H9NO2/c1-11-8-4-2-3-7(5-8)6-9-10/h2-6,10H,1H3
charge 0 multiplicity 1
20 atoms
O  2.694438 -1.188012 -0.018154
O  -4.466726 -0.64597 -0.154712
N  -3.233866 0.085826 -0.111111
C  -0.803652 -0.003008 -0.061376
C  1.638185 -0.26292 -0.016164
C  0.343173 -0.832859 -0.058927
C  -0.647687 1.414519 -0.020502
C  1.798233 1.143363 0.024703
C  0.643399 1.965983 0.021792
C  -2.129559 -0.63838 -0.105646
C  4.058669 -0.655888 0.025477
H  0.255794 -1.924709 -0.089511
H  -1.539216 2.047725 -0.022754
H  2.790898 1.601443 0.0582
H  0.767795 3.054067 0.053262
H  -2.155235 -1.748776 -0.133382
H  4.233926 -0.07171 0.949921
H  4.273192 -0.024121 -0.858512
H  4.712175 -1.540346 0.016377
H  -4.297035 -1.641125 -0.174881
