program: Gaussian 09
title: 000293576
version: EM64L-G09RevD.01
frameworkgroup: C1[X(C7H12ClNO2)]
method: RPBEPBE
basis: SDD
operation: Freq
keyword: #p
keyword: freq=noraman
keyword: PBEPBE/SDD
title: #p freq=noraman PBEPBE/SDD
converged: YES YES NO NO
title: Mulliken charges:
elementType: Cl O O N C C C C C C C H H H H H H H H H H H H
charge: -0.055733 -0.262054 -0.244833 -0.093340 -0.412252 -0.420194 -0.394140 -0.506307 0.266371 -0.224124 -0.559723 0.217340 0.241001 0.240732 0.217131 0.248413 0.190623 0.255145 0.265455 0.226685 0.266919 0.258446 0.278440
chargesum: 0.00000
title: Mulliken charges with hydrogens summed into heavy atoms:
elementType: Cl O O N C C C C C C C
charge: -0.055733 -0.262054 -0.244833 -0.093340 0.046089 0.037670 0.044895 0.014293 0.266371 0.269480 -0.022837
polarizability: 1.17482217e+02 -4.62673687e+00 8.97825542e+01 -5.27635577e+00 -2.85558081e-01 8.02887002e+01
1716.lowfreq: -14.9094 -8.3422 -3.8830 0.0020 0.0021 0.0022 5.5698 13.1089 30.5364
frequency: -12.0891 12.5972 30.4685 72.7690 85.7241 117.5900 167.2575 204.4983 246.9498 288.7977 319.8556 376.8148 423.2107 477.8817 548.5533 608.8968 656.4641 724.2457 784.8893 795.9627 811.7686 828.0720 901.1624 942.7430 973.7234 987.2340 993.3499 1056.5540 1062.8240 1075.0159 1081.4726 1090.5069 1112.3549 1126.3196 1143.4857 1181.4973 1189.6355 1221.8332 1260.6721 1276.0788 1296.7721 1301.7218 1355.4445 1379.7647 1433.7984 1439.1624 1453.9620 1460.3854 1466.4504 1477.8424 1651.2095 2903.9971 2995.9279 3006.6671 3045.8895 3052.1824 3060.0418 3062.8499 3066.8894 3082.5736 3144.4014 3164.4967 3181.7629
redmass: 7.4995 3.4064 4.9916 4.2317 3.3439 2.8263 3.4049 4.0187 3.3291 3.0272 4.3082 2.4407 3.1467 3.1879 2.7416 4.9291 5.6579 3.2314 1.4671 2.5682 1.4766 2.9771 2.8156 2.5258 1.2339 1.7462 2.0580 1.6893 1.4205 2.0809 1.3662 2.8787 2.1300 1.8916 1.5506 1.2827 1.3440 1.1418 2.4959 1.3408 1.2523 1.4193 1.3824 1.5768 1.1036 1.0814 1.0844 1.0794 1.1151 1.1420 9.7498 1.0701 1.0617 1.0607 1.0918 1.0512 1.0592 1.0622 1.0974 1.0998 1.1098 1.1143 1.1152
irintensity: 1.3541 1.7321 2.5528 1.6012 3.0990 2.8013 4.7383 6.7588 0.2718 4.2520 13.9551 6.7145 8.1475 7.5667 1.6806 23.4935 6.9348 8.1869 7.6938 3.2083 2.8090 6.3527 27.6496 34.3696 13.4636 1.0664 79.9638 13.4866 9.2419 5.1437 23.9240 38.6668 232.0887 71.2593 10.2489 1.3074 0.5296 3.7271 8.3086 28.2139 28.6738 52.1199 0.2340 69.4163 10.4460 22.4174 8.9016 17.7544 0.8061 9.8811 169.4822 59.6505 31.0042 8.7060 4.2122 28.9077 24.2867 32.3990 21.8949 6.5795 9.6652 1.7782 42.2106
temp: 298.150 k
press: 1.00000 atm
elementType: 17 8 8 7 6 6 6 6 6 6 6 1 1 1 1 1 1 1 1 1 1 1 1
symmnumber: 1
zpe: 482955.9 jmol-1
zpe.correction: 0.183948 hartree
zpe.thermalcorrener: 0.195640 hartree
zpe.thermalcorrenthalpy: 0.196584 hartree
zpe.thermalcorrgfe: 0.142790 hartree
zpe.sumelectzpe: -938.268806 hartree
zpe.sumelectthermal: -938.257114 hartree
zpe.sumelectthermalent: -938.256170 hartree
zpe.sumelectthermalfe: -938.309964 hartree
dipole: 0.6602 -0.3275 -1.1551
dipole: 1.3702
quadrupole: -62.0008 -74.4055 -76.0442
quadrupole: -11.2343 -8.3019 2.1118
quadrupole: 8.8160 -3.5887 -5.2274 -11.2343 -8.3019 2.1118
hfenergy: -938.4527543 hartree
pointgroup: C01 [X(C7H12Cl1N1O2)]
dipole: 0.2998938 0.1130132 -0.4334703 debye
dipolederiv: -0.1999654 0.0129983 0.0417805 -0.0542266 -0.30251 -0.1484426 -0.0349161 -0.196383 -0.4123047 -1.7178994 -0.268523 0.1123216 -0.2431806 -0.4744825 0.1075764 0.1826689 0.1382091 -0.3601382 -0.7340558 0.0714476 -0.0335476 -0.2211598 -0.767544 0.2625628 0.1739196 0.2926778 -0.4497489 -0.6343668 0.2712277 0.0880149 0.3057488 -0.2056324 -0.0577634 0.1425191 -0.068969 -0.3905573 0.1331463 -0.0429127 0.0614717 -0.0867707 0.0087896 0.0065571 0.0436607 -0.0111296 0.197733 0.0824091 -0.1102698 0.0151036 -0.114917 0.0576456 -0.0693568 0.0058363 -0.060627 0.1755026 0.509376 -0.176101 0.0320027 -0.1303474 0.2249893 0.0439376 0.0310124 -0.0056185 0.2668972 -0.3137445 0.0941753 -0.0213454 0.1994717 -0.080162 0.0766604 -0.1474987 0.1554186 0.034179 1.8571467 0.098704 -0.0736134 0.413688 0.9656763 -0.4348985 -0.3923607 -0.5175032 0.4761602 0.7654543 0.0392911 0.0623687 -0.24234 0.1021488 0.0107387 0.1459252 0.0255477 0.1710192 0.1059844 -0.0404533 -0.0535816 0.0163747 0.3356887 0.2306444 -0.0004168 0.250247 0.5637912 0.0234986 0.0019107 -0.0303273 -0.0253227 0.0319744 0.1151945 0.0691467 0.1178806 -0.0791291 -0.1344455 -0.0292616 -0.0554445 -0.0422495 0.0926768 0.0217404 -0.0854624 0.009903 0.0411625 0.0862807 0.031662 -0.0387541 0.0703291 -0.103581 0.0412403 -0.0460079 0.0762486 0.044011 0.045338 -0.0193726 -0.122846 0.0051312 0.0180303 -0.0138064 -0.0897249 -0.0848101 -0.0815496 0.0277671 0.0016091 0.0008437 0.0138223 -0.1185767 -0.0456938 -0.0017903 -0.0483497 0.0650138 -0.0437024 0.0418757 0.0129944 0.0160318 0.0444305 -0.0214532 -0.0729166 0.0613241 -0.218032 0.0651551 -0.0158926 -0.0181721 -0.0520278 -0.0505134 -0.0336591 0.0154037 -0.065384 0.0942229 0.0887118 0.0114039 -0.0050668 -0.0164138 0.1131239 -0.005556 0.0568842 -0.0024539 -0.0515558 -0.0804908 -0.0200938 -0.0073546 0.0759777 0.0295212 -0.1054515 0.0537836 -0.1208295 -0.0447584 0.0530402 -0.0338268 0.0228265 0.0763751 0.058882 0.060503 -0.0514505 0.0729449 0.0246241 -0.1067471 0.0541938 0.0050554 0.0617044 0.0405167 -0.0549458 -0.0189693 -0.0517961 0.0211597 0.1221092 0.0262081 0.0052697 -0.025699 -0.0210921 0.0136717 0.0207538 0.0334523 -0.0877024 unknown
polarizability: 118.5377219|-1.1260787|87.7533141|-3.4630775|3.603406|81.2624352 unknown
InChI: InChI=1S/C7H12ClNO2/c8-2-6-11-7(10)1-3-9-4-5-9/h1-6H2
charge 0 multiplicity 1
23 atoms
Cl 3.56585 1.189203 1.629104
O  1.693599 -0.191153 -0.647565
O  0.566392 -1.871638 0.523061
N  -3.142602 0.132685 -0.550063
C  -4.417805 0.056994 0.249115
C  -3.579199 1.326989 0.267181
C  -1.991368 -0.63704 -0.003982
C  -0.693433 -0.043769 -0.575405
C  0.536815 -0.820701 -0.154154
C  2.999062 -0.792791 -0.287568
C  3.978928 0.329752 0.002995
H  -4.422625 -0.552217 1.164041
H  -5.338961 0.013675 -0.339875
H  -3.891902 2.202562 -0.309861
H  -3.029928 1.549956 1.193363
H  -2.098308 -1.687077 -0.329256
H  -1.950461 -0.638042 1.111453
H  -0.568209 1.01175 -0.269014
H  -0.748016 -0.032533 -1.680453
H  3.351207 -1.370298 -1.164996
H  2.869873 -1.47874 0.567262
H  5.001583 -0.060934 0.119748
H  3.945306 1.114368 -0.766533
