program: Gaussian 09
title: 000293581
version: EM64L-G09RevD.01
frameworkgroup: C1[X(C12H17ClN2O)]
method: RPBEPBE
basis: SDD
operation: Freq
keyword: #p
keyword: freq=noraman
keyword: PBEPBE/SDD
title: #p freq=noraman PBEPBE/SDD
converged: YES YES NO NO
title: Mulliken charges:
elementType: Cl O N N C C C C C C C C C C C C H H H H H H H H H H H H H H H H H
charge: -0.086204 -0.300514 -0.483139 -0.416905 -0.570298 0.348953 -0.364645 0.268892 -0.404764 -0.352437 -0.678981 -0.260255 -0.237634 0.286326 -0.325124 -0.551842 0.182365 0.228792 0.225054 0.206137 0.228569 0.304831 0.201902 0.214881 0.226701 0.300083 0.224704 0.225201 0.270552 0.243778 0.296660 0.267919 0.280441
chargesum: 0.00000
title: Mulliken charges with hydrogens summed into heavy atoms:
elementType: Cl O N N C C C C C C C C C C C C
charge: -0.086204 -0.300514 -0.183056 -0.120245 -0.159141 0.348953 0.066546 0.268892 -0.176195 -0.047606 -0.035497 -0.035551 -0.012434 0.286326 0.189205 -0.003482
polarizability: 2.12906101e+02 -9.58420051e+00 1.75493999e+02 -8.61017144e+00 1.27707186e+01 9.19243462e+01
1716.lowfreq: -9.8808 -0.2918 -0.0021 -0.0013 -0.0010 4.1973 13.4111 26.5890 52.4974
frequency: 13.2824 26.5078 52.4547 59.3346 65.6869 88.3433 100.4806 113.1634 131.5749 209.6829 224.4028 242.8939 268.1358 287.0949 304.5008 322.4808 375.0306 398.4215 428.7671 470.1163 475.5666 541.9937 581.4376 593.9819 603.7784 612.0290 702.6806 706.8771 740.1694 746.5862 764.9752 786.5321 834.7957 858.3085 865.7297 882.0979 893.7453 954.0186 962.5312 987.4211 994.8605 1033.6161 1041.5126 1046.9189 1055.8440 1092.4783 1116.3338 1135.5441 1168.9011 1173.4611 1192.7173 1210.6882 1217.1713 1237.1407 1261.7798 1273.8892 1288.2699 1296.5146 1305.3820 1337.1572 1366.5531 1381.4343 1392.5727 1438.6248 1440.5418 1445.8903 1456.6522 1476.1401 1479.1211 1483.4014 1489.4815 1501.0363 1521.8076 1594.9388 1617.8184 1643.4999 2934.4189 2972.7764 2983.1473 2991.8707 3017.3834 3038.9100 3050.3305 3065.2587 3069.2700 3077.2357 3116.1447 3134.7059 3154.2269 3159.2329 3190.3604 3535.8814 3545.5956
redmass: 6.3724 5.1561 4.3556 6.0638 3.9580 2.5480 2.5681 3.2311 4.3886 3.9842 1.9914 1.5847 3.8484 3.4253 3.0044 3.0460 3.5228 1.4818 2.7002 3.1507 2.6983 3.1251 4.1552 4.0083 1.5106 4.0173 9.7084 4.0559 2.1615 1.4842 1.3381 3.1891 3.1096 2.4790 1.3210 1.6346 1.6905 1.3673 2.4510 2.5703 1.3002 1.8786 1.9939 2.6172 1.8525 2.1286 2.1878 1.9711 1.4227 1.1262 1.7028 1.5394 1.4737 1.4919 1.4913 1.3765 1.4682 1.1966 1.5624 1.4662 1.3991 4.3731 1.2134 1.4246 1.4624 1.2582 1.8042 1.0536 1.0562 1.2391 1.5959 1.3012 1.9763 6.0036 6.0141 3.9528 1.0687 1.0361 1.0627 1.0598 1.0902 1.0994 1.0966 1.0620 1.1006 1.0994 1.0878 1.0894 1.1121 1.0982 1.0949 1.0764 1.0761
irintensity: 0.3077 0.2625 2.2737 10.0110 1.5710 1.5027 0.7487 4.3789 5.8552 2.2057 2.2506 2.9021 0.9106 0.6026 3.5603 6.0410 22.3104 15.9175 1.5280 6.0759 23.5697 25.6377 13.4785 14.6161 119.2044 31.1452 6.6196 12.1609 2.5173 6.7575 92.3765 4.1376 0.6977 17.5836 1.1393 0.1866 8.8840 3.6969 12.3103 5.8097 2.5050 1.2857 6.9877 0.1175 10.8559 12.2278 9.1594 1.2021 11.1291 3.1691 24.6561 69.2000 2.5303 268.7438 3.9586 9.3942 13.8191 31.7242 80.2474 0.8286 9.7765 43.5113 12.2126 61.1509 40.1570 54.6550 26.7021 13.7080 4.0454 169.1751 195.7730 85.6872 456.4043 87.4280 5.8681 123.4238 38.9826 40.3105 22.1055 59.4221 12.1261 11.5536 6.8986 23.4904 76.2938 41.2262 11.1800 17.5413 17.1908 29.4852 10.1776 20.2323 29.2455
temp: 298.150 k
press: 1.00000 atm
elementType: 17 8 7 7 6 6 6 6 6 6 6 6 6 6 6 6 1 1 1 1 1 1 1 1 1 1 1 1 1 1 1 1 1
symmnumber: 1
zpe: 714912.6 jmol-1
zpe.correction: 0.272296 hartree
zpe.thermalcorrener: 0.289289 hartree
zpe.thermalcorrenthalpy: 0.290234 hartree
zpe.thermalcorrgfe: 0.224377 hartree
zpe.sumelectzpe: -1111.081166 hartree
zpe.sumelectthermal: -1111.064173 hartree
zpe.sumelectthermalent: -1111.063229 hartree
zpe.sumelectthermalfe: -1111.129085 hartree
dipole: -0.4473 2.3076 0.6091
dipole: 2.4282
quadrupole: -97.8924 -105.2251 -105.0862
quadrupole: 10.2241 -1.2134 2.8805
quadrupole: 4.8422 -2.4905 -2.3516 10.2241 -1.2134 2.8805
hfenergy: -1111.3534621 hartree
pointgroup: C01 [X(C12H17Cl1N2O1)]
dipole: 0.0311953 -0.9273727 0.2272316 debye
polarizability: 208.971495|-14.8765336|179.7089066|7.0511586|-12.8517588|91.6440444 unknown
InChI: InChI=1S/C12H17ClN2O/c1-2-5-10-6-3-4-7-11(10)15-12(16)14-9-8-13/h3-4,6-7,14-15H,2,5,8-9H2,1H3
charge 0 multiplicity 1
33 atoms
Cl 4.896894 -2.013551 -0.182306
O  1.582262 2.040911 0.022227
N  0.196015 0.161448 0.432086
N  2.519419 -0.007316 0.638536
C  -2.032006 -1.688063 0.661964
C  -2.21706 -0.214429 0.317737
C  -1.593673 -2.559012 -0.552498
C  -1.107399 0.682088 0.182431
C  -3.517421 0.290802 0.084439
C  -1.322447 2.037961 -0.180965
C  -1.38864 -4.040777 -0.172948
C  -3.740244 1.636561 -0.281414
C  -2.633236 2.503576 -0.412892
C  1.42963 0.821224 0.338497
C  3.88704 0.505188 0.581248
C  4.72327 -0.1458 -0.52004
H  -1.306282 -1.830231 1.493773
H  -2.988265 -2.090188 1.046402
H  -2.367331 -2.473789 -1.33923
H  -0.664764 -2.150834 -0.998797
H  -4.36965 -0.391598 0.193741
H  -0.462028 2.702782 -0.274868
H  -0.596657 -4.156028 0.591986
H  -2.317066 -4.476597 0.241552
H  -1.096702 -4.643155 -1.052061
H  0.218778 -0.812668 0.737122
H  -4.758278 2.000524 -0.455935
H  -2.78415 3.551828 -0.694318
H  3.806215 1.589232 0.371357
H  4.393172 0.380436 1.557444
H  2.404721 -1.008641 0.806869
H  5.754708 0.236065 -0.540809
H  4.247378 -0.076249 -1.508532
