program: Gaussian 09
title: 000293575
version: EM64L-G09RevD.01
frameworkgroup: C1[X(C10H11ClO3)]
method: RPBEPBE
basis: SDD
operation: Freq
keyword: #p
keyword: freq=noraman
keyword: PBEPBE/SDD
title: #p freq=noraman PBEPBE/SDD
converged: YES YES NO NO
title: Mulliken charges:
elementType: Cl O O O C C C C C C C C C C H H H H H H H H H H H
charge: -0.063824 -0.278441 -0.264395 -0.234782 0.347405 -0.458216 0.320542 -0.376335 -0.315821 -0.321406 -0.335744 0.229022 -0.560215 -0.537481 0.268915 0.269377 0.259493 0.300186 0.257120 0.244399 0.279938 0.277157 0.222944 0.222874 0.247287
chargesum: 0.00000
title: Mulliken charges with hydrogens summed into heavy atoms:
elementType: Cl O O O C C C C C C C C C C
charge: -0.063824 -0.278441 -0.264395 -0.234782 0.347405 0.080076 0.320542 -0.116842 -0.015635 -0.064285 -0.091345 0.229022 -0.003119 0.155624
polarizability: 2.14172436e+02 -5.79954535e+00 1.19033089e+02 6.87003888e-01 3.44683937e-03 6.33311611e+01
1716.lowfreq: -7.7584 -4.4051 -2.4358 -0.0022 0.0013 0.0023 25.7458 33.3302 45.5299
frequency: 25.7258 32.9066 45.4904 61.8252 79.8518 110.7605 152.4241 173.9804 216.7418 238.8048 247.5525 305.3692 347.2403 371.0984 417.7446 444.9375 515.4183 518.7142 542.8577 618.1845 633.5001 711.3910 714.6500 730.5821 778.1669 797.7937 811.7394 834.3144 899.7126 950.8774 962.5838 986.9845 991.5775 998.2858 1074.5226 1107.5031 1113.6327 1122.7067 1130.0781 1150.3430 1159.0307 1179.8769 1235.1980 1255.2732 1263.0066 1294.1139 1337.8477 1378.5073 1421.8558 1437.1960 1445.0164 1460.9568 1467.6761 1471.6599 1488.3886 1589.3276 1616.5730 1631.0528 2961.3081 3016.9121 3049.6002 3071.2146 3078.1754 3127.8119 3159.2230 3160.9873 3162.2004 3180.0203 3210.3640
redmass: 8.7565 3.1148 3.0132 7.8567 3.7311 3.6773 6.0165 3.4355 7.7202 1.2493 4.2940 8.5076 4.8680 6.1377 3.0647 4.8449 2.5294 5.3915 2.9434 7.3523 7.7566 6.8085 3.6245 5.9759 1.2485 6.5127 1.2640 1.6364 6.4368 1.3378 1.3325 8.7274 1.5330 2.7243 4.1413 1.3661 1.2594 2.2289 1.2602 1.7926 1.7070 1.4383 4.3116 1.2749 1.1497 1.2769 1.6227 6.9376 3.8095 1.1784 1.0938 1.0975 1.0495 1.1068 2.1831 7.9634 6.3908 9.7582 1.0330 1.0614 1.1041 1.0999 1.0572 1.0994 1.0884 1.0901 1.1114 1.0976 1.0943
irintensity: 0.1771 0.4326 1.4443 0.0343 9.5748 0.0918 7.6711 7.6243 2.8850 1.2094 3.9017 1.4677 15.2272 0.1015 0.1481 1.0435 20.3703 22.4646 0.1918 2.4755 27.2709 22.6619 0.2846 47.3062 12.8421 3.3884 6.2298 95.9774 11.0871 3.0012 0.8038 39.8037 0.6132 17.4883 14.9036 85.2281 0.1705 273.4702 40.0227 162.6983 126.7912 198.3313 48.9280 30.4151 0.9873 0.5013 105.3956 5.5219 0.2247 25.3899 28.0157 9.7208 14.0544 94.4697 179.7836 9.2577 41.6907 195.5079 64.1856 8.2825 48.2479 1.9086 9.7629 24.2404 7.0544 7.4679 9.4770 3.5065 3.3164
temp: 298.150 k
press: 1.00000 atm
elementType: 17 8 8 8 6 6 6 6 6 6 6 6 6 6 1 1 1 1 1 1 1 1 1 1 1
symmnumber: 1
zpe: 498118.7 jmol-1
zpe.correction: 0.189723 hartree
zpe.thermalcorrener: 0.203992 hartree
zpe.thermalcorrenthalpy: 0.204936 hartree
zpe.thermalcorrgfe: 0.145722 hartree
zpe.sumelectzpe: -1072.339566 hartree
zpe.sumelectthermal: -1072.325297 hartree
zpe.sumelectthermalent: -1072.324353 hartree
zpe.sumelectthermalfe: -1072.383567 hartree
dipole: 3.2907 -0.7147 0.0092
dipole: 3.3674
quadrupole: -90.3815 -85.4075 -90.0582
quadrupole: -8.5892 -0.0319 -0.0182
quadrupole: -1.7658 3.2083 -1.4424 -8.5892 -0.0319 -0.0182
hfenergy: -1072.5292889 hartree
pointgroup: C01 [X(C10H11Cl1O3)]
dipole: 1.2914254 -0.2925675 -0.043208 debye
dipolederiv: -0.6535904 0.0579002 0.0075233 0.1521494 -0.2165312 -0.0046032 0.0216658 -0.0045987 -0.1784771 -2.138337 -0.3008537 -0.0857259 -0.7170008 -0.554416 -0.088433 -0.1730514 -0.0819466 -0.1838924 -1.8188711 0.3618233 0.0527457 0.3045294 -0.4021229 -0.0166014 0.0392308 -0.0148846 -0.3030791 -0.7153336 0.1029902 0.0158244 -0.6528441 -0.876529 -0.123472 -0.1399218 -0.1131262 -0.3154666 1.1371835 0.0709929 0.029019 -0.1052176 -0.0252734 -0.016627 -0.00641 -0.0148704 0.0487441 -0.3639262 0.0717448 0.0067525 0.3462434 -0.1473996 -0.0324986 0.0283138 -0.0311347 0.0753609 1.6481734 -0.2401853 -0.0263126 0.023263 0.0030167 -0.0202721 0.0296453 -0.0245425 0.0965167 -0.0170979 0.0485694 0.0132423 -0.0120362 0.0677751 0.0467503 0.0001114 0.048053 -0.1476257 -0.0676031 -0.1045177 -0.0211809 0.0223649 -0.0187764 0.0235121 0.0043994 0.0205796 -0.1234013 -0.3004244 0.0124189 0.0004316 0.3219388 0.0228266 0.0458772 0.0657475 0.0411799 -0.1618514 -0.4083433 0.0805479 0.0140811 -0.3102365 0.0261742 0.0448693 -0.0685926 0.0504556 -0.1990439 2.005469 0.1189677 0.0532572 1.1781452 1.245904 0.2202721 0.2901822 0.2039485 0.254275 0.8115971 -0.1634964 -0.021896 -0.1692415 0.2348284 0.0032488 -0.0191488 0.0007713 0.2027171 0.5693505 -0.1639686 -0.0311002 -0.5544202 0.4753751 0.0224343 -0.1124164 0.0281758 0.3332957 0.0426429 -0.0026063 -0.010917 -0.0589052 0.0761601 -0.0669087 -0.0136137 -0.0725259 -0.00821 0.0351951 -0.0015729 0.0078022 -0.0563231 0.0352423 0.0774615 0.0021965 0.0829597 0.0319033 0.0728291 0.0776375 0.0147332 0.0749891 -0.0012284 -0.0349721 0.0139197 -0.0350037 0.1634361 0.1464626 -0.0466896 -0.0105209 -0.0452455 0.0667115 -0.0244108 -0.0103483 -0.0237976 0.173944 0.0302242 -0.0774696 -0.018345 -0.0726524 0.0104965 -0.0348556 -0.0176186 -0.034887 0.1631294 0.0295926 0.0717377 0.0133055 0.0947722 -0.0302293 -0.0397421 0.0181453 -0.0398845 0.1568984 -0.0053084 0.0547552 0.0193355 0.0138533 0.0363614 -0.0676002 -0.0050484 -0.0733273 -0.0318551 -0.0114907 0.0579935 -0.0047628 0.0129615 -0.0068488 0.0771607 0.0080271 0.0838491 0.0043161 0.0691131 -0.0246215 -0.0840801 0.1305458 -0.0126892 -0.0752356 0.0205112 -0.0928574 -0.1296047 0.0660091 -0.0622342 0.072264 0.1223459 -0.0938405 0.0940631 0.0389966 0.1059233 -0.0443781 -0.1635161 0.0001367 -0.0054758 -0.0439789 0.0850131 -0.009417 -0.0149226 -0.0085089 0.1223486 unknown
polarizability: 214.0082939|-7.1176267|116.9961635|0.7020469|10.8010652|65.532229 unknown
InChI: InChI=1S/C10H11ClO3/c1-13-8-2-4-9(5-3-8)14-10(12)6-7-11/h2-5H,6-7H2,1H3
charge 0 multiplicity 1
25 atoms
Cl -6.304135 0.253358 0.014829
O  -1.157852 0.642762 0.119453
O  4.463096 0.212541 0.115886
O  -1.969246 -1.524962 -0.325815
C  0.253772 0.384377 0.086518
C  -3.517764 0.368572 0.019809
C  3.061432 0.194452 0.08934
C  1.035346 1.536144 0.340574
C  0.859792 -0.8644 -0.167399
C  2.435309 1.442893 0.342381
C  2.272165 -0.953111 -0.164777
C  -2.15925 -0.31111 -0.087763
C  -4.652568 -0.650064 -0.110485
C  5.161124 -1.050891 -0.136275
H  -3.577302 0.906152 0.983217
H  -3.593287 1.140207 -0.768634
H  0.53297 2.488525 0.533121
H  0.251944 -1.74832 -0.361539
H  3.062353 2.317679 0.536188
H  2.734476 -1.924499 -0.362451
H  -4.655176 -1.156676 -1.084975
H  -4.649631 -1.391252 0.700333
H  4.935228 -1.44009 -1.148122
H  4.899104 -1.813473 0.622786
H  6.230897 -0.807013 -0.0631
