program: Gaussian 09
title: 000293654
version: EM64L-G09RevD.01
frameworkgroup: C1[X(C23H29NO2)]
method: RPBEPBE
basis: SDD
operation: Freq
keyword: #p
keyword: freq=noraman
keyword: PBEPBE/SDD
title: #p freq=noraman PBEPBE/SDD
converged: YES YES NO NO
title: Mulliken charges:
elementType: O O N C C C C C C C C C C C C C C C C C C C C C C C H H H H H H H H H H H H H H H H H H H H H H H H H H H H H
charge: -0.272853 -0.465372 -0.085403 0.217778 -0.479193 -0.126445 -0.000560 0.091941 -0.456958 -0.628959 -0.718386 -0.715401 -0.260379 -0.719804 0.507480 0.426138 -0.430713 -0.376508 -0.442051 -0.393363 -0.229964 -0.238704 -0.220897 -0.226946 -0.245438 -0.244207 0.287706 0.220921 0.209940 0.218068 0.242415 0.231457 0.215663 0.240687 0.207873 0.217637 0.230498 0.221752 0.199009 0.228624 0.239270 0.238275 0.210301 0.223946 0.231933 0.232325 0.338834 0.238771 0.269541 0.221813 0.221349 0.222571 0.223238 0.224840 0.225908
chargesum: 0.00000
title: Mulliken charges with hydrogens summed into heavy atoms:
elementType: O O N C C C C C C C C C C C C C C C C C C C C C C C
charge: -0.272853 -0.126538 -0.085403 0.217778 -0.048332 0.161261 0.217508 0.091941 0.016914 -0.172609 -0.062378 -0.066016 -0.021110 -0.047282 0.507480 0.426138 -0.198780 -0.144183 -0.203280 -0.123822 -0.008151 -0.017355 0.001674 -0.003708 -0.020597 -0.018299
polarizability: 2.96635311e+02 1.84890539e+01 2.68537286e+02 8.28934629e+00 -3.43546702e+01 1.98844206e+02
1716.lowfreq: -24.1616 -7.3985 -0.0004 0.0004 0.0004 4.1436 8.3512 16.9056 22.1976
frequency: -19.6031 16.6376 22.0081 24.9232 30.8437 43.1873 56.3149 74.3772 84.8591 109.3978 132.8583 147.1320 148.0088 180.3152 195.5150 201.2302 206.6720 207.1073 231.5430 262.3379 274.9731 310.4613 318.0710 329.8748 342.6588 349.1471 361.5035 390.1801 402.8630 405.1837 430.4908 449.2726 468.3243 482.2206 493.5359 510.8922 526.6687 546.1840 555.7178 615.4179 616.8784 619.1185 628.0288 684.4204 704.4848 707.7013 751.9548 766.6210 774.5136 793.1780 798.0472 819.0581 839.7315 851.9921 857.2784 859.3181 875.1346 900.5326 915.5827 919.8557 927.2847 930.0495 935.1314 970.6357 974.3908 980.0431 988.5247 990.1071 991.5791 994.2833 995.2716 997.5664 1013.5245 1025.6818 1026.5476 1030.7837 1035.8503 1072.4633 1082.2995 1082.6368 1088.8865 1129.5455 1141.6365 1158.6560 1170.3776 1170.6602 1171.6224 1181.4669 1187.6295 1195.3487 1202.1448 1211.0695 1217.3334 1225.1266 1255.4663 1270.3483 1281.6616 1286.1833 1292.3112 1296.8463 1317.8623 1321.5229 1333.3417 1341.4834 1352.4378 1356.2013 1365.6429 1374.2793 1382.4868 1388.5462 1390.9612 1391.3338 1435.8433 1438.8985 1440.0145 1441.2996 1453.9368 1460.3390 1465.1613 1469.5604 1475.2216 1476.1642 1480.2633 1483.9507 1485.0902 1592.0477 1593.2062 1612.4154 1614.3030 1626.6193 2977.3763 2979.3302 2979.8529 2983.0422 2987.8630 2988.6142 2990.4068 3006.2321 3016.5289 3050.4503 3050.5295 3072.5334 3075.1479 3080.8751 3084.9977 3088.7941 3092.5993 3098.2987 3114.2769 3114.3468 3116.1115 3122.6250 3130.3364 3135.1093 3141.7543 3146.3489 3159.9305 3160.7806 3560.5124
redmass: 3.6663 4.6869 3.9798 4.1552 4.1348 4.2391 4.7941 4.3588 4.3166 4.1709 2.5491 4.2183 3.8895 3.4358 1.1057 2.1403 4.4840 1.4339 1.1896 2.1007 2.7307 2.4716 1.5287 2.6379 1.8525 2.6700 3.9227 2.6245 2.8201 2.8084 2.7607 4.4161 3.7222 2.8338 3.4603 3.4224 2.9286 2.8906 4.7717 6.2541 6.2411 4.8743 4.0347 5.8560 1.8113 1.7409 1.9057 1.8991 3.1077 3.7048 4.2318 3.7410 2.9766 1.2706 1.3450 1.9260 2.1083 2.2879 1.9090 1.4920 1.6093 1.6826 1.8549 1.7678 1.3880 1.3838 5.5108 5.7509 1.4075 1.2965 1.4139 2.9683 2.8121 2.1441 2.2350 2.6335 1.7094 2.1160 1.7251 2.1150 1.8351 2.1331 1.8526 1.2060 1.0688 1.2256 1.5880 1.1213 1.1322 1.6604 2.9101 1.9084 2.2575 2.3406 1.8141 1.3314 1.3286 1.3610 1.5100 1.3801 1.3094 1.2607 1.2542 1.3213 1.5140 1.5657 1.6500 1.2134 7.4358 5.2722 1.2453 1.2135 1.1174 1.0865 2.0610 2.1134 1.0553 1.0484 1.0494 1.0612 1.1284 1.0787 2.3082 2.1047 1.0519 6.0327 6.0888 6.1039 6.1199 10.5430 1.0435 1.0826 1.0541 1.0505 1.0604 1.0572 1.0441 1.0615 1.0806 1.1025 1.1019 1.1018 1.1001 1.0994 1.0995 1.0992 1.0994 1.1003 1.0853 1.0860 1.0874 1.0866 1.0913 1.0918 1.0960 1.0957 1.1015 1.1014 1.0660
irintensity: 0.2314 0.0865 0.0606 0.5008 0.0365 1.0934 0.3571 0.1160 0.0310 0.5949 0.0095 0.7894 0.3232 1.3258 0.0721 0.5789 0.7759 0.0398 0.6231 3.3222 4.1724 3.7128 78.4641 10.7466 33.0961 31.2439 0.7062 5.1571 0.0482 0.7683 1.6381 12.0423 0.7511 4.7775 13.5470 11.4980 12.4273 26.1204 1.4076 0.2565 0.2182 4.6246 6.3623 3.9881 53.5914 51.8305 25.8891 47.7155 6.6525 8.6677 14.0824 3.1732 4.4208 0.6436 1.7232 3.7528 7.0302 0.5639 14.5003 6.6585 7.1153 3.1509 13.8787 12.0915 0.1577 0.5584 1.3360 0.4373 1.0480 4.7365 2.6251 22.4094 74.0080 31.4794 14.1032 92.4174 20.8827 20.3188 22.7253 21.8672 23.2516 61.3672 36.1250 5.5601 0.3170 7.1791 18.2362 0.7035 1.7427 5.8666 18.8457 9.0087 5.1460 37.4129 23.4260 41.5772 10.8961 3.4569 13.4102 22.4516 5.7915 0.4785 1.0919 2.0666 15.6540 3.0411 18.8905 20.8872 0.1919 0.8521 11.8110 26.4554 14.1987 3.9990 4.0965 10.5245 3.3428 15.5755 6.0245 5.1708 5.6908 16.1179 14.3139 16.1325 15.0293 2.8289 1.2614 5.4438 11.7154 166.8951 10.9641 17.6595 23.4811 38.5092 8.0493 31.6116 51.9575 16.0308 4.1414 25.4608 13.2580 14.7897 21.4658 41.1026 24.0447 48.6466 42.6162 27.1256 7.8766 8.5295 2.2223 0.6414 15.1121 22.3334 45.0926 30.6681 26.7634 26.6085 4.7012
temp: 298.150 k
press: 1.00000 atm
elementType: 8 8 7 6 6 6 6 6 6 6 6 6 6 6 6 6 6 6 6 6 6 6 6 6 6 6 1 1 1 1 1 1 1 1 1 1 1 1 1 1 1 1 1 1 1 1 1 1 1 1 1 1 1 1 1
symmnumber: 1
zpe: 1218201.3 jmol-1
zpe.correction: 0.463988 hartree
zpe.thermalcorrener: 0.488988 hartree
zpe.thermalcorrenthalpy: 0.489932 hartree
zpe.thermalcorrgfe: 0.407000 hartree
zpe.sumelectzpe: -1097.109483 hartree
zpe.sumelectthermal: -1097.084484 hartree
zpe.sumelectthermalent: -1097.083540 hartree
zpe.sumelectthermalfe: -1097.166472 hartree
dipole: -2.7922 -1.4062 -0.2531
dipole: 3.1366
quadrupole: -132.6282 -153.3870 -152.3678
quadrupole: 2.2703 1.8956 -1.3931
quadrupole: 13.4995 -7.2593 -6.2401 2.2703 1.8956 -1.3931
hfenergy: -1097.5734718 hartree
pointgroup: C01 [X(C23H29N1O2)]
dipole: 1.2178235 -0.1960442 0.0357061 debye
polarizability: 304.6859423|-4.7785612|243.6610885|-6.0379024|44.6605055|215.6697718 unknown
InChI: InChI=1S/C23H29NO2/c1-17-16-23(2,3)24-22(26-17)20(14-18-10-6-4-7-11-18)15-21(25)19-12-8-5-9-13-19/h4-13,17,20-21,25H,14-16H2,1-3H3
charge 0 multiplicity 1
55 atoms
O  2.318884 1.694542 0.997569
O  -0.877019 -1.386059 1.913024
N  2.256722 -0.155235 -0.580968
C  3.746176 -0.17044 -0.749959
C  4.379556 1.173698 -0.284487
C  0.167265 0.845503 0.334822
C  3.812535 1.622704 1.07316
C  1.678128 0.71403 0.192958
C  -0.589515 -0.362995 -0.253258
C  -0.290271 2.191791 -0.330838
C  4.306839 -1.373384 0.053467
C  4.015829 -0.38942 -2.256879
C  -0.384461 -1.666954 0.542283
C  4.28106 3.005397 1.5233
C  -1.736174 2.555794 -0.02607
C  -1.123115 -2.841139 -0.091843
C  -2.72683 2.551526 -1.04069
C  -2.124272 2.913867 1.29227
C  -0.429474 -3.755834 -0.922495
C  -2.515088 -3.01847 0.117195
C  -4.067737 2.896373 -0.751303
C  -3.460901 3.258781 1.587059
C  -1.113186 -4.827666 -1.540237
C  -3.198999 -4.091283 -0.496248
C  -4.439908 3.251774 0.564929
C  -2.501008 -4.999058 -1.327932
H  -0.054784 0.908032 1.417313
H  4.158576 1.959029 -1.034217
H  5.479418 1.07853 -0.21151
H  4.045325 0.869004 1.852733
H  -1.671448 -0.135032 -0.268157
H  -0.257652 -0.539143 -1.292365
H  -0.141336 2.111055 -1.425018
H  0.380433 2.990815 0.036749
H  5.382684 -1.514309 -0.160255
H  4.179047 -1.235788 1.14238
H  3.770363 -2.294906 -0.23368
H  3.575169 0.428871 -2.853842
H  5.10233 -0.430486 -2.459448
H  3.554883 -1.33613 -2.588219
H  0.700844 -1.894169 0.574168
H  3.78486 3.293978 2.465693
H  5.373977 3.003946 1.688306
H  4.041356 3.764389 0.757887
H  -2.444557 2.276974 -2.064865
H  -1.371233 2.923425 2.090429
H  -0.832484 -2.224946 2.438286
H  0.647209 -3.622059 -1.087256
H  -3.048574 -2.312186 0.763439
H  -4.818116 2.887495 -1.550348
H  -3.740448 3.534248 2.610578
H  -0.566318 -5.529011 -2.18098
H  -4.274605 -4.220694 -0.328405
H  -5.477739 3.5207 0.792342
H  -3.032315 -5.831777 -1.802861
