program: Gaussian 09
title: 000293614
version: EM64L-G09RevD.01
frameworkgroup: C1[X(C22H16N4O)]
method: RPBEPBE
basis: SDD
operation: Freq
keyword: #p
keyword: freq=noraman
keyword: PBEPBE/SDD
title: #p freq=noraman PBEPBE/SDD
converged: YES YES NO NO
title: Mulliken charges:
elementType: O N N N N C C C C C C C C C C C C C C C C C C C C C C H H H H H H H H H H H H H H H H
charge: -0.246666 -0.246627 -0.354500 0.057612 0.005828 -0.252369 0.390365 0.269327 0.210955 -0.398650 -0.465049 0.425610 0.418831 -0.375280 -0.227931 -0.226917 -0.132127 -0.360574 -0.362729 -0.358060 -0.337418 -0.210430 -0.218027 -0.217531 -0.218875 -0.250115 -0.249874 0.310134 0.250387 0.256457 0.241031 0.237556 0.236961 0.262730 0.261364 0.245406 0.257267 0.228975 0.226511 0.228091 0.229425 0.229520 0.229407
chargesum: 0.00000
title: Mulliken charges with hydrogens summed into heavy atoms:
elementType: O N N N N C C C C C C C C C C C C C C C C C C C C C C
charge: -0.246666 -0.246627 -0.354500 0.057612 0.005828 0.057765 0.390365 0.269327 0.210955 -0.148263 -0.208592 0.425610 0.418831 -0.134249 0.009624 0.010043 -0.132127 -0.097844 -0.101366 -0.112653 -0.080150 0.018545 0.008485 0.010559 0.010550 -0.020595 -0.020467
polarizability: 3.69130998e+02 -3.06826594e+01 2.75259458e+02 1.87705639e+01 4.74029550e+00 1.79157320e+02
1716.lowfreq: -5.4418 0.0002 0.0008 0.0011 3.5881 7.4470 21.8083 25.4251 32.5299
frequency: 21.7376 25.2976 32.4836 47.9124 61.2517 67.3051 69.0049 86.1403 96.1733 124.4954 152.0884 187.9648 199.7936 238.3749 239.7822 253.2693 293.6959 302.8036 343.1248 360.2279 394.8227 404.6235 407.4918 422.6559 434.8868 451.8548 497.1738 504.8220 520.2879 529.8272 566.6239 595.9930 607.6515 612.7369 615.6396 635.6282 651.1989 687.2101 693.3054 694.2936 698.8905 747.5861 755.7152 763.5243 769.2799 778.8057 796.6186 835.5305 840.9750 859.4773 870.4687 883.3188 898.8639 907.5215 911.6129 927.4299 935.6994 960.0036 968.1046 970.7661 987.4746 988.9825 989.4446 990.7572 995.3713 1022.4144 1027.6096 1030.6234 1066.3622 1080.9864 1087.0199 1092.7223 1123.9514 1171.2046 1172.5275 1177.3286 1181.8464 1185.5340 1189.9165 1208.8155 1228.9956 1246.6178 1265.6656 1284.2677 1297.8647 1315.7971 1325.0480 1337.3743 1344.6302 1376.8165 1387.3442 1394.6342 1439.7225 1440.6617 1445.5830 1479.6411 1481.7631 1483.0313 1534.0910 1576.0234 1593.3628 1596.1895 1597.6161 1605.2357 1612.9725 1615.8573 2185.1887 3042.5034 3127.5871 3129.5806 3130.4040 3135.1699 3135.5434 3139.5964 3147.5122 3150.2569 3151.2290 3154.1777 3158.4156 3163.3784 3169.6673 3170.0620 3173.5631
redmass: 6.3147 5.9223 3.9336 5.7625 4.5325 5.5939 4.9274 6.3203 8.8111 6.7671 6.6600 5.0082 6.3520 4.6978 7.3355 4.6772 6.3796 5.4027 6.3570 5.6551 4.4705 2.8511 2.8501 6.4864 5.7362 6.8221 4.1444 5.2665 3.9988 5.6835 5.9982 4.7507 5.8420 6.5654 6.4381 6.2915 6.4993 5.6013 2.0520 2.3796 5.3802 3.1613 1.9824 1.7316 1.4251 4.7979 4.6042 1.2603 1.2535 1.4374 3.1620 2.9623 1.9265 1.5586 1.5378 4.6290 4.5312 1.4583 1.3844 1.3844 2.6071 5.4914 1.8806 1.3311 1.3469 2.4103 2.0507 2.2856 2.7599 1.7445 2.5723 2.1898 1.8178 1.0516 1.0490 1.0646 1.1511 1.6058 1.1668 2.9475 2.6189 2.0899 4.1878 1.8748 1.8342 1.3797 1.3476 2.0058 1.7728 7.6888 9.7755 5.8964 2.3223 2.4518 2.3467 2.3638 2.2788 2.7794 7.3044 9.4001 6.8236 6.7945 6.7136 6.1317 6.6708 6.5515 12.5797 1.0837 1.0848 1.0849 1.0866 1.0884 1.0901 1.0889 1.0934 1.0936 1.0924 1.0932 1.0963 1.0966 1.1005 1.1012 1.1004
irintensity: 1.5967 0.8097 0.5720 1.7378 0.4479 0.4102 0.4534 2.1741 0.8917 2.8811 2.4859 0.6673 0.3809 1.0740 2.4402 3.9139 2.9355 0.1719 4.5804 6.1617 2.1556 1.7861 0.2695 1.6197 2.5161 6.1418 4.3052 5.2645 12.2831 5.4046 1.1634 8.3446 46.5473 5.5295 2.4369 8.7860 11.5756 4.4652 40.0060 26.4954 42.3037 35.6141 41.0068 69.5268 43.3407 32.0755 25.9471 0.7817 0.8674 47.5223 31.5153 40.3698 7.3655 1.7694 0.3402 44.9782 1.1531 1.7060 0.1929 0.0739 0.3214 0.5450 0.1627 0.1110 0.0436 4.6795 11.3856 0.5625 13.2246 37.0461 85.9715 26.5047 1.2558 0.1281 0.0905 0.6281 2.6123 9.0746 0.8923 19.5427 18.3510 97.8323 66.1457 257.2979 308.0101 21.3081 1.9451 471.9504 69.9222 9.1158 0.7644 3.1520 8.6243 22.0217 5.5556 66.8437 78.9795 11.3904 38.9053 220.7705 46.4265 0.9930 11.4342 41.2861 1.3337 30.6706 0.1301 1.5553 2.3964 1.8426 2.7257 3.7364 0.8824 8.7567 24.8765 8.8291 16.0246 31.5946 20.7743 22.2865 26.9124 11.9110 8.0805
temp: 298.150 k
press: 1.00000 atm
elementType: 8 7 7 7 7 6 6 6 6 6 6 6 6 6 6 6 6 6 6 6 6 6 6 6 6 6 6 1 1 1 1 1 1 1 1 1 1 1 1 1 1 1 1
symmnumber: 1
zpe: 853854.8 jmol-1
zpe.correction: 0.325216 hartree
zpe.thermalcorrener: 0.347080 hartree
zpe.thermalcorrenthalpy: 0.348024 hartree
zpe.thermalcorrgfe: 0.271988 hartree
zpe.sumelectzpe: -1140.291867 hartree
zpe.sumelectthermal: -1140.270004 hartree
zpe.sumelectthermalent: -1140.269059 hartree
zpe.sumelectthermalfe: -1140.345096 hartree
dipole: -2.1257 5.7998 -1.2355
dipole: 6.2994
quadrupole: -125.3130 -161.4463 -153.5749
quadrupole: -8.7212 10.2685 6.3565
quadrupole: 21.4651 -14.6683 -6.7968 -8.7212 10.2685 6.3565
hfenergy: -1140.6170836 hartree
pointgroup: C01 [X(C22H16N4O1)]
dipole: -0.8713816 2.2822982 -0.4174279 debye
polarizability: 370.5755444|-29.8729615|274.3829225|13.1750692|7.6469642|178.5893086 unknown
InChI: InChI=1S/C22H16N4O/c23-15-21-20-14-8-7-9-17(20)16-24-26(21)22(27)25(18-10-3-1-4-11-18)19-12-5-2-6-13-19/h1-14,16,21H
charge 0 multiplicity 1
43 atoms
O  0.668628 -2.011007 -1.015638
N  -0.751828 -0.571217 0.114018
N  1.587187 -0.023819 -0.121949
N  -0.869439 0.319478 1.185825
N  -2.078312 -3.613782 1.282055
C  -1.882039 -1.451313 -0.302649
C  -3.18551 -0.655277 -0.258874
C  -3.294378 0.358293 0.734726
C  0.539195 -0.924643 -0.379327
C  -4.27678 -0.955683 -1.095356
C  -2.096202 0.705174 1.501667
C  1.383937 1.410145 -0.029587
C  2.949259 -0.521915 -0.172983
C  -4.522306 1.053059 0.889384
C  -5.495751 -0.254962 -0.938391
C  -5.619017 0.743238 0.058947
C  -1.972327 -2.655706 0.579689
C  1.980502 2.138781 1.026258
C  3.963155 0.251083 -0.790346
C  0.64474 2.086486 -1.029288
C  3.274282 -1.768804 0.417181
C  1.822853 3.538454 1.088226
C  5.293832 -0.220461 -0.810181
C  0.475418 3.486643 -0.951699
C  4.603847 -2.235882 0.382272
C  1.064725 4.218698 0.104392
C  5.6222 -1.4650 -0.226648
H  -1.652336 -1.81732 -1.318487
H  -4.187843 -1.742368 -1.85329
H  -2.155669 1.39721 2.347879
H  -4.607628 1.836818 1.650972
H  -6.34812 -0.493077 -1.583139
H  -6.567775 1.275932 0.183285
H  2.550066 1.604417 1.792852
H  3.712506 1.211095 -1.251949
H  0.207975 1.519564 -1.85899
H  2.492493 -2.372829 0.886457
H  2.282842 4.098096 1.910204
H  6.070869 0.384206 -1.290826
H  -0.10252 4.005588 -1.724486
H  4.844959 -3.202691 0.837459
H  0.940497 5.30572 0.158532
H  6.654512 -1.830419 -0.247003
