program: Gaussian 09
title: 000293562
version: EM64L-G09RevD.01
frameworkgroup: C1[X(C11H7BrF6O2)]
method: RPBEPBE
basis: SDD
operation: Freq
keyword: #p
keyword: freq=noraman
keyword: PBEPBE/SDD
title: #p freq=noraman PBEPBE/SDD
converged: YES YES NO NO
title: Mulliken charges:
elementType: Br F F F F F F O O C C C C C C C C C C C H H H H H H H
charge: 0.062499 -0.156731 -0.154367 -0.118339 -0.146125 -0.118235 -0.156821 -0.406228 -0.265721 0.015448 -0.621496 0.385814 0.371656 0.198749 0.314051 -0.321111 -0.320333 -0.187302 -0.181442 -0.216039 0.276118 0.301734 0.390676 0.236124 0.290706 0.262480 0.264234
chargesum: 0.00000
title: Mulliken charges with hydrogens summed into heavy atoms:
elementType: Br F F F F F F O O C C C C C C C C C C C
charge: 0.062499 -0.156731 -0.154367 -0.118339 -0.146125 -0.118235 -0.156821 -0.015552 -0.265721 0.015448 -0.043644 0.385814 0.371656 0.198749 0.314051 -0.084986 -0.029627 0.075178 0.082792 -0.216039
polarizability: 2.45577579e+02 1.20782889e+01 1.22354344e+02 -1.88366805e+01 -1.91209237e+01 8.73589042e+01
1716.lowfreq: 0.0007 0.0009 0.0009 2.3329 3.1475 6.1845 10.6761 27.9205 30.1457
frequency: 10.5119 27.8056 30.1191 51.5981 68.6355 78.6048 102.5246 135.4717 163.5725 182.3811 212.2631 240.8651 242.9910 252.3113 282.3581 287.9881 295.8656 312.7949 341.7617 367.2845 401.7786 416.8554 453.7135 459.0792 467.6049 487.4567 510.3366 553.1816 560.9293 613.4866 616.2338 620.7228 666.4323 706.8061 730.5098 750.7894 775.6773 829.0892 853.8108 857.1908 924.8950 966.8188 984.5648 988.2910 994.2696 1000.8128 1006.4231 1048.8035 1058.8784 1061.5942 1087.7883 1105.5591 1119.8569 1154.8965 1170.7988 1195.9046 1245.5498 1273.0825 1299.2936 1337.5986 1371.5744 1402.8967 1428.8719 1439.0835 1474.5359 1544.4969 1577.9510 1594.4282 3006.6197 3083.6599 3106.7885 3156.0218 3161.5942 3178.4626 3181.8367
redmass: 12.6863 8.2737 5.8335 14.5372 8.7802 13.5841 11.0368 14.0495 9.9168 12.3390 6.6374 8.1664 7.3965 7.6385 13.5586 6.0865 14.8454 8.3952 6.8167 6.4485 2.8318 12.1453 4.5578 10.8074 7.0623 15.1740 7.7574 8.7133 3.4137 9.1100 8.0497 7.2755 11.1684 4.6437 4.4240 1.1050 4.5031 1.3778 1.4682 4.7656 4.6296 1.3908 10.3207 5.1366 2.4549 1.7454 3.3110 9.1935 10.1225 2.7332 10.4223 5.4413 1.3982 4.0664 5.2971 1.1794 2.1301 1.6607 1.3087 1.9986 3.9959 4.0230 1.3753 1.2142 2.3169 4.8694 6.1776 6.1427 1.0664 1.0681 1.0931 1.0885 1.0889 1.0963 1.0977
irintensity: 0.4801 0.2169 0.0315 0.4475 0.3810 0.5494 0.7590 1.6939 1.4289 9.0976 3.8288 0.3689 0.5101 0.2942 3.3522 1.5924 0.5606 0.4593 18.2767 16.8048 0.3021 3.6474 1.6416 8.8307 18.6900 2.6236 58.6296 2.3782 28.7738 35.4887 19.2006 4.5563 1.7759 3.6678 9.9628 92.9047 23.9099 26.8574 70.7367 27.1903 69.9642 0.8291 55.4537 111.7427 107.1457 33.3021 31.7518 10.0764 239.4154 98.5954 209.0019 4.9290 6.0093 128.3031 506.0652 3.6140 184.0676 64.6253 6.1293 62.8645 45.6070 51.1370 243.1120 160.3437 11.8257 101.2187 68.7489 143.2149 8.2553 708.2178 1.1859 7.0096 0.8659 4.3072 1.0529
temp: 298.150 k
press: 1.00000 atm
elementType: 35 9 9 9 9 9 9 8 8 6 6 6 6 6 6 6 6 6 6 6 1 1 1 1 1 1 1
symmnumber: 1
zpe: 429183.6 jmol-1
zpe.correction: 0.163467 hartree
zpe.thermalcorrener: 0.182379 hartree
zpe.thermalcorrenthalpy: 0.183323 hartree
zpe.thermalcorrgfe: 0.112437 hartree
zpe.sumelectzpe: -1184.849736 hartree
zpe.sumelectthermal: -1184.830824 hartree
zpe.sumelectthermalent: -1184.829880 hartree
zpe.sumelectthermalfe: -1184.900766 hartree
dipole: -5.9275 -1.6412 -0.7908
dipole: 6.2011
quadrupole: -141.6071 -120.5816 -127.7563
quadrupole: -3.5051 0.9004 -1.5985
quadrupole: -11.6255 9.4001 2.2254 -3.5051 0.9004 -1.5985
hfenergy: -1185.013203 hartree
pointgroup: C01 [X(C11H7Br1F6O2)]
dipole: -2.3273931 0.7278081 0.0759087 debye
polarizability: 242.7068567|-9.6431898|115.3707935|27.9974342|-24.7184804|97.2131767 unknown
InChI: InChI=1S/C11H7BrF6O2/c12-7-3-1-6(2-4-7)8(19)5-9(20,10(13,14)15)11(16,17)18/h1-4,20H,5H2
charge 0 multiplicity 1
27 atoms
Br -6.456183 0.49893 -0.760119
F  1.814111 0.113802 -2.188409
F  1.117683 -1.781494 -1.161043
F  3.331408 -1.365275 -1.384522
F  3.04648 1.697234 1.651569
F  4.429082 0.605798 0.234881
F  2.914134 2.08738 -0.574364
O  2.383196 -1.00909 1.303607
O  -0.187646 -1.390371 1.570943
C  2.042959 -0.055335 0.288483
C  0.636916 0.608677 0.462226
C  2.1036 -0.765643 -1.113007
C  3.12484 1.068431 0.391262
C  -0.474786 -0.378934 0.844299
C  -1.878676 -0.128676 0.431416
C  -2.280644 1.017967 -0.308538
C  -2.86405 -1.084149 0.812962
C  -3.631641 1.208907 -0.659858
C  -4.213587 -0.908493 0.463662
C  -4.584849 0.24178 -0.271549
H  0.391283 1.183031 -0.44305
H  0.71272 1.331078 1.298981
H  1.510038 -1.420807 1.626202
H  -1.55542 1.777205 -0.616508
H  -2.545102 -1.961577 1.383906
H  -3.938029 2.091878 -1.22692
H  -4.965036 -1.647355 0.754586
