program: Gaussian 09
title: 000293540
version: EM64L-G09RevD.01
frameworkgroup: C1[X(C10H15NO2)]
method: RPBEPBE
basis: SDD
operation: Freq
keyword: #p
keyword: freq=noraman
keyword: PBEPBE/SDD
title: #p freq=noraman PBEPBE/SDD
converged: YES YES NO NO
title: Mulliken charges:
elementType: O O N C C C C C C C C C C H H H H H H H H H H H H H H H
charge: -0.480967 -0.300393 -0.015027 -0.177309 -0.437591 0.422647 -0.418071 -0.399156 -0.596582 -0.229695 -0.219258 -0.243536 -0.483409 0.202097 0.243270 0.229391 0.228417 0.285036 0.225796 0.220212 0.229598 0.366709 0.222089 0.222970 0.225097 0.214636 0.228007 0.235023
chargesum: 0.00000
title: Mulliken charges with hydrogens summed into heavy atoms:
elementType: O O N C C C C C C C C C C
charge: -0.114258 -0.300393 -0.015027 0.024788 0.035071 0.422647 -0.189654 -0.114120 0.079023 -0.007606 0.003711 -0.018439 0.194256
polarizability: 1.62243443e+02 -6.31891999e+00 1.12761486e+02 7.85915100e+00 1.32909486e+01 8.72918946e+01
1716.lowfreq: -12.4713 -0.0008 -0.0005 0.0002 2.9263 8.4931 28.9328 33.8237 71.3153
frequency: 28.8645 33.7276 71.2911 91.1644 116.3212 170.5892 215.2534 231.7510 243.8344 253.3947 290.2238 327.8579 390.5265 404.7768 434.6666 462.2922 496.0442 540.9565 616.2736 619.9821 650.3929 683.3295 706.6376 759.2242 818.2320 857.7262 878.9983 913.8029 939.6776 967.2328 980.6526 989.2899 999.1334 1000.8154 1024.7374 1041.7716 1061.8745 1092.1354 1116.5993 1123.7877 1143.8021 1169.2528 1176.2243 1179.0549 1199.7763 1219.7968 1247.4584 1295.8023 1324.7230 1340.8174 1386.5380 1403.3882 1414.2280 1421.6377 1427.7054 1436.9649 1445.5977 1454.4669 1474.5043 1477.0640 1483.4301 1594.0703 1615.2190 2924.1729 2939.6527 2945.9400 2971.8536 3046.7212 3056.9697 3070.9767 3098.6009 3104.0242 3105.6886 3123.4801 3137.3996 3156.0926 3173.3960 3374.6140
redmass: 3.7449 3.9759 3.2555 3.5132 3.0066 1.1866 2.8761 1.2911 3.0776 4.3736 2.4508 4.6687 3.6624 2.8728 3.7992 3.3615 2.9042 2.8167 6.3222 5.2582 1.2296 3.0561 1.8508 1.7740 4.2880 1.2520 2.6489 1.8748 2.2615 7.5083 1.3599 5.9781 2.4493 1.3829 2.2199 2.7287 2.0559 1.9018 1.3027 1.4273 1.4697 1.0762 1.7407 1.3034 2.3499 1.3314 1.1781 1.2086 1.2357 1.3145 7.6097 1.2637 1.2226 1.2051 1.1058 2.1738 1.0652 1.0471 1.0520 1.0541 2.3768 6.2704 6.1588 1.0690 1.0788 1.0422 1.0292 1.0935 1.0911 1.1043 1.1006 1.1032 1.0876 1.0865 1.0929 1.0984 1.0960 1.0653
irintensity: 0.8127 1.7474 1.1624 3.0915 1.2381 0.0678 5.6579 1.7068 8.7541 3.6713 9.8528 6.6224 1.9120 0.2080 12.6632 1.7444 2.5406 17.7409 0.0445 22.3033 65.8299 30.4886 55.4525 58.3873 1.9524 0.4268 6.7281 6.2991 15.0400 65.7453 0.2187 0.0675 17.3140 3.1428 11.0311 9.2644 34.1998 18.2792 0.0204 0.8080 0.4055 1.1074 0.2644 6.0715 20.2841 6.0326 13.1555 9.6229 20.2439 8.8549 2.1026 38.0470 11.7666 15.3838 13.2728 12.6067 17.7129 18.4180 7.5703 18.8855 13.7395 0.5283 6.4107 8.6751 50.2115 81.4657 60.9862 4.8949 35.2336 45.5747 27.9630 20.5405 12.6542 1.4774 35.5982 30.6912 8.9088 213.6597
temp: 298.150 k
press: 1.00000 atm
elementType: 8 8 7 6 6 6 6 6 6 6 6 6 6 1 1 1 1 1 1 1 1 1 1 1 1 1 1 1
symmnumber: 1
zpe: 611333.3 jmol-1
zpe.correction: 0.232845 hartree
zpe.thermalcorrener: 0.246341 hartree
zpe.thermalcorrenthalpy: 0.247286 hartree
zpe.thermalcorrgfe: 0.191642 hartree
zpe.sumelectzpe: -594.183326 hartree
zpe.sumelectthermal: -594.169829 hartree
zpe.sumelectthermalent: -594.168885 hartree
zpe.sumelectthermalfe: -594.224528 hartree
dipole: 2.5273 2.4752 -0.0505
dipole: 3.5379
quadrupole: -64.1839 -77.3175 -78.6007
quadrupole: -1.1666 2.8593 1.1378
quadrupole: 9.1835 -3.9501 -5.2333 -1.1666 2.8593 1.1378
hfenergy: -594.4161705 hartree
pointgroup: C01 [X(C10H15N1O2)]
dipole: -1.1011695 0.5405352 0.6577756 debye
polarizability: 159.7629004|-0.5149812|110.5004913|16.0750121|15.6941566|92.0334324 unknown
InChI: InChI=1S/C10H15NO2/c1-11(13-2)8-10(12)9-6-4-3-5-7-9/h3-7,10,12H,8H2,1-2H3
charge 0 multiplicity 1
28 atoms
O  -0.466198 -1.071566 -1.334315
O  -3.070166 -0.716505 -0.55324
N  -2.611498 0.40008 0.397799
C  -0.269436 0.120843 -0.50628
C  -1.19323 0.069458 0.737209
C  1.198183 0.201631 -0.094637
C  1.724577 1.417476 0.411176
C  2.041593 -0.93047 -0.187099
C  -3.494974 0.28166 1.591391
C  3.070553 1.497877 0.831156
C  3.38999 -0.850388 0.231169
C  3.908519 0.360664 0.744749
C  -3.898499 -0.102535 -1.604636
H  -0.542053 1.035225 -1.079504
H  -0.881551 0.835889 1.47064
H  -1.098953 -0.933136 1.214627
H  1.084832 2.308532 0.466916
H  1.627301 -1.852158 -0.605321
H  -3.211476 1.079267 2.301864
H  -3.412932 -0.705232 2.094166
H  -4.541127 0.446516 1.286073
H  -1.446944 -1.266993 -1.292243
H  3.467467 2.443967 1.217035
H  4.036875 -1.731859 0.152021
H  4.954348 0.421764 1.067013
H  -4.813336 0.345574 -1.174224
H  -4.172183 -0.936119 -2.273897
H  -3.330684 0.668242 -2.155306
