program: Gaussian 09
title: 000293526
version: EM64L-G09RevD.01
frameworkgroup: C1[X(C14H15F6N3O2)]
method: RPBEPBE
basis: SDD
operation: Freq
keyword: #p
keyword: freq=noraman
keyword: PBEPBE/SDD
title: #p freq=noraman PBEPBE/SDD
converged: YES YES NO NO
title: Mulliken charges:
elementType: F F F F F F O O N N N C C C C C C C C C C C C C C H H H H H H H H H H H H H H H
charge: -0.141133 -0.135115 -0.153770 -0.148695 -0.151368 -0.121480 -0.408068 -0.245873 -0.111399 -0.031893 0.010144 0.030228 -0.608789 0.380775 0.378770 0.146825 -0.338989 -0.342873 -0.301213 -0.312502 -0.400730 0.103668 -0.371473 -0.182014 -0.297837 0.289569 0.264212 0.239372 0.226910 0.240604 0.225221 0.225102 0.200986 0.199018 0.229016 0.381638 0.280326 0.239047 0.240811 0.272970
chargesum: 0.00000
title: Mulliken charges with hydrogens summed into heavy atoms:
elementType: F F F F F F O O N N N C C C C C C C C C C C C C C
charge: -0.141133 -0.135115 -0.153770 -0.148695 -0.151368 -0.121480 -0.026429 -0.245873 -0.111399 -0.031893 0.010144 0.030228 -0.055008 0.380775 0.378770 0.146825 0.127293 0.122952 0.124875 0.115531 -0.120404 0.103668 -0.132427 0.058798 -0.024867
polarizability: 3.21265370e+02 3.15025426e+01 1.80638627e+02 -1.10465694e+01 1.57779749e+01 1.24659903e+02
1716.lowfreq: -11.0837 -4.4706 -1.9270 -0.0004 -0.0004 0.0006 16.4796 17.9833 34.1926
frequency: 15.3514 17.6690 34.0398 45.4390 51.5672 59.5758 63.9171 91.4769 113.6160 134.8281 152.3075 189.8236 197.3380 209.7279 219.3441 230.0578 244.8186 259.6927 278.2768 292.2900 300.1636 310.8940 319.8439 338.7176 359.6022 377.2340 383.1564 404.2808 439.5241 459.4248 460.4124 461.1788 463.8550 489.2073 514.7773 533.5867 568.0540 579.8261 590.2435 614.9895 642.9035 661.7267 702.2068 740.0301 757.4795 803.9414 811.3013 813.8184 836.7750 850.9607 892.3285 894.6172 916.8782 922.9203 949.2682 950.8448 972.0883 998.1039 1001.2042 1004.3441 1014.7590 1033.2340 1052.7140 1062.3594 1071.3903 1078.8246 1079.7701 1096.3293 1097.7034 1136.4226 1143.3170 1149.2850 1168.4176 1177.3201 1192.0977 1232.3544 1252.0126 1259.5590 1271.9638 1278.0043 1291.6867 1308.3632 1323.1543 1335.2046 1349.9339 1355.5106 1360.3816 1370.1438 1376.6033 1408.0114 1448.4242 1449.4103 1451.8605 1453.0488 1456.8119 1461.6426 1553.4902 1561.4775 1579.8047 2946.0060 2950.4544 2958.7621 2964.0545 3043.5650 3050.2931 3074.5158 3082.8785 3089.6148 3094.3037 3113.2913 3133.8215 3153.4809 3177.3378 3475.2538
redmass: 9.4330 11.2461 3.2496 12.1077 6.2097 6.4571 8.6475 5.9290 4.9707 9.3310 11.5865 6.9461 5.6799 2.2789 5.0216 3.3505 4.5977 9.5019 8.8582 6.9286 5.8739 4.9275 8.6398 2.2749 1.5924 2.2641 2.2849 8.6084 4.2816 4.2661 13.2244 3.9706 9.2317 14.0449 4.5791 7.7301 6.9885 4.1041 3.4021 9.5549 4.5566 7.6437 5.5085 3.9683 2.3868 3.9529 2.5036 2.4309 1.7716 3.3766 2.1631 2.1858 2.3215 1.4125 3.2577 5.7695 3.7554 3.0062 1.3522 4.8576 2.4775 9.9458 1.8942 7.3446 5.2015 2.4335 4.0106 2.2581 5.1179 2.9223 2.3958 4.1468 1.1631 2.7186 1.0707 2.0652 1.7360 1.4388 1.9710 1.4022 1.4987 1.5977 2.0070 1.3508 1.4020 1.5150 1.7626 2.2892 1.2917 2.8024 1.8189 1.0958 1.0988 1.3432 1.1073 1.1113 5.5169 6.0950 6.1529 1.0681 1.0699 1.0658 1.0660 1.0593 1.0949 1.0879 1.0933 1.0962 1.0977 1.1034 1.0883 1.0942 1.0975 1.0660
irintensity: 0.4351 0.3103 0.1042 0.4151 0.1917 0.7729 0.1370 0.9125 6.9316 0.6845 3.0440 1.7956 9.3865 7.4513 5.8656 3.6381 14.2345 0.9156 14.9591 1.6479 28.3068 12.3062 17.3257 57.4246 88.1133 17.0582 6.5927 23.7544 2.4531 2.8700 7.1191 5.3255 14.4871 0.9728 4.3078 5.5490 8.7186 12.1408 43.9547 20.0416 34.9401 9.3383 3.1041 0.9624 21.3005 5.4208 24.3838 6.2367 6.7436 33.3405 45.3133 37.0672 18.2223 3.4216 49.6303 78.7240 124.0333 23.7659 0.9021 35.3529 16.9419 43.8587 22.1871 272.3003 174.1461 43.7266 46.4293 68.9173 103.3276 80.0101 362.9084 201.5680 47.1572 1.1033 0.5576 16.2079 17.8637 35.7081 29.9525 3.3178 4.5972 16.2348 2.8822 14.8725 4.2069 82.8632 14.7273 4.9063 17.8629 74.7613 80.3555 2.9476 11.0250 4.4973 68.6124 8.5157 280.8693 192.6241 61.4459 38.0658 63.5154 31.3633 106.5872 2.3712 19.2024 30.2031 17.8147 26.8894 38.0135 0.8703 5.3998 7.9041 5.7792 116.9934
temp: 298.150 k
press: 1.00000 atm
elementType: 9 9 9 9 9 9 8 8 7 7 7 6 6 6 6 6 6 6 6 6 6 6 6 6 6 1 1 1 1 1 1 1 1 1 1 1 1 1 1 1
symmnumber: 1
zpe: 747931.0 jmol-1
zpe.correction: 0.284872 hartree
zpe.thermalcorrener: 0.308508 hartree
zpe.thermalcorrenthalpy: 0.309453 hartree
zpe.thermalcorrgfe: 0.229136 hartree
zpe.sumelectzpe: -1454.295431 hartree
zpe.sumelectthermal: -1454.271795 hartree
zpe.sumelectthermalent: -1454.270850 hartree
zpe.sumelectthermalfe: -1454.351167 hartree
dipole: -6.0280 3.3014 -1.0427
dipole: 6.9515
quadrupole: -155.3641 -135.8988 -144.0948
quadrupole: 2.3572 -1.8868 6.1468
quadrupole: -10.2449 9.2204 1.0244 2.3572 -1.8868 6.1468
hfenergy: -1454.5803031 hartree
pointgroup: C01 [X(C14H15F6N3O2)]
dipole: 2.3600234 -1.259111 0.5698665 debye
polarizability: 319.054756|40.027719|152.9798829|10.2715556|-28.4172918|154.5292615 unknown
InChI: InChI=1S/C14H15F6N3O2/c15-13(16,17)12(24,14(18,19)20)8-10-2-1-3-11(22-10)9-21-23-4-6-25-7-5-23/h1-3,9,24H,4-8H2
charge 0 multiplicity 1
40 atoms
F  -2.19473 1.6536 -1.704489
F  -3.767037 2.418183 -0.274452
F  -1.879913 1.480085 0.539032
F  -5.364081 -1.372327 -1.321218
F  -4.637205 0.377426 -2.568498
F  -5.847431 0.730988 -0.682125
O  -3.896202 -0.32909 0.922701
O  6.958537 1.352158 -0.154138
N  4.435071 0.052639 0.266369
N  -0.173588 -0.839808 -0.469052
N  3.255005 -0.531174 0.629762
C  -3.503324 -0.050195 -0.442728
C  -2.53981 -1.128325 -1.046267
C  -2.845284 1.378046 -0.48821
C  -4.844441 -0.062561 -1.238751
C  -1.353903 -1.445568 -0.14794
C  5.435178 0.119098 1.354649
C  4.559303 1.079981 -0.796992
C  6.85181 0.207615 0.767065
C  6.025272 1.166025 -1.27208
C  -1.489622 -2.325174 0.957656
C  0.924891 -1.075479 0.32506
C  2.146869 -0.37969 -0.08305
C  -0.352533 -2.564883 1.773104
C  0.86301 -1.933727 1.46547
H  -2.169043 -0.782138 -2.023927
H  -3.142793 -2.03968 -1.193863
H  5.313272 -0.784567 1.974408
H  5.244693 1.010043 1.991139
H  4.210572 2.065782 -0.418994
H  3.928743 0.797791 -1.659272
H  7.59388 0.391142 1.560246
H  7.104768 -0.731556 0.229478
H  6.287547 0.241089 -1.830034
H  6.163302 2.041008 -1.927449
H  -3.085242 -0.584882 1.440972
H  -2.435284 -2.846618 1.14144
H  2.043089 0.2460 -0.982346
H  -0.424531 -3.242363 2.63066
H  1.765986 -2.084497 2.062565
