program: Gaussian 09
title: 000293509
version: EM64L-G09RevD.01
frameworkgroup: C1[X(C13H16N2O)]
method: RPBEPBE
basis: SDD
operation: Freq
keyword: #p
keyword: freq=noraman
keyword: PBEPBE/SDD
title: #p freq=noraman PBEPBE/SDD
converged: YES YES NO NO
title: Mulliken charges:
elementType: O N N C C C C C C C C C C C C C H H H H H H H H H H H H H H H H
charge: -0.267247 -0.162114 -0.406378 0.040801 -0.376485 -0.375524 0.399420 0.412672 -0.420322 -0.419498 -0.542858 -0.546581 -0.600025 -0.703802 0.500171 -0.087599 0.207259 0.205000 0.209153 0.203387 0.220114 0.204357 0.203915 0.221409 0.236463 0.217916 0.216846 0.224617 0.307894 0.219146 0.296506 0.161388
chargesum: 0.00000
title: Mulliken charges with hydrogens summed into heavy atoms:
elementType: O N N C C C C C C C C C C C C C
charge: -0.267247 -0.162114 -0.109872 0.040801 0.035774 0.037016 0.399420 0.412672 0.004149 0.005826 -0.088479 -0.105118 -0.292131 -0.484657 0.500171 0.073789
polarizability: 2.39134211e+02 -7.18766181e-01 1.69057507e+02 3.23991913e+00 -5.24651283e-01 8.72341150e+01
1716.lowfreq: -6.1229 -0.0010 -0.0010 -0.0007 7.1281 13.5358 47.4200 75.4008 81.9377
frequency: 47.3957 75.3629 81.9271 122.5633 138.4849 165.4875 206.7920 247.2805 297.6884 304.6448 310.1400 366.2670 408.1935 415.3527 428.1080 457.1684 484.7355 499.8602 526.8992 562.2154 612.6263 633.1774 643.5114 657.9146 737.8135 812.7050 848.2815 850.5439 864.7756 880.2036 886.4793 898.3439 913.9846 924.3817 940.4578 963.9276 1019.6789 1028.4686 1067.1530 1075.9859 1080.4798 1086.0138 1128.9300 1151.8750 1180.9669 1192.9644 1197.2386 1213.4443 1214.3339 1240.2085 1263.7941 1281.9047 1295.2376 1316.4547 1328.2389 1335.3559 1345.1871 1348.8237 1351.4762 1365.4685 1389.7169 1407.2236 1432.2330 1453.6373 1457.7255 1464.2878 1465.4594 1476.4227 1479.7097 1515.2807 1519.7031 1593.2769 1625.6465 1634.8729 2889.7732 2897.2813 2915.1255 2957.9839 2961.6011 2996.7914 2997.6129 3014.1544 3016.2571 3029.7266 3038.3217 3063.7651 3064.6297 3090.6309 3169.0494 3513.8355
redmass: 5.5262 2.7977 2.4828 3.3898 6.4960 3.0571 2.9613 6.5374 2.2758 2.5944 1.8830 4.4676 3.2572 4.5668 4.5995 4.0419 3.0830 3.7495 3.4665 2.6808 2.8128 2.3559 1.3293 4.5861 4.1313 4.3029 1.5973 1.9431 1.6015 1.9680 1.9635 2.8149 2.6024 1.5467 1.3892 3.1211 2.4784 2.6607 2.4938 1.8021 1.8207 2.1765 2.0815 1.3560 1.3004 1.5936 1.3301 1.6737 2.0544 1.3082 1.2898 1.3488 2.0206 2.1563 1.3936 1.8435 1.4657 1.4095 1.4881 2.0716 1.9027 2.1023 3.6278 1.2798 1.1001 1.0959 1.1051 1.0884 1.3554 2.1275 1.9372 6.2508 5.6202 5.5072 1.0697 1.0715 1.0852 1.0655 1.0667 1.0661 1.0651 1.0870 1.0856 1.0921 1.0930 1.1041 1.1041 1.0909 1.0929 1.0767
irintensity: 2.4475 7.4661 1.6548 14.7332 9.6827 9.4472 0.7143 4.5824 5.1876 7.1956 2.7592 6.7784 0.9837 8.4481 11.2603 0.9219 0.5928 0.7809 0.4153 0.1545 9.8294 6.5471 60.5565 0.6850 10.4847 5.1810 7.4940 0.4562 12.9138 9.0370 11.8393 1.3153 6.1290 3.6866 26.9927 4.3424 0.2387 1.4726 19.1791 0.9824 0.9714 1.3267 36.4156 5.2160 22.4072 9.0163 1.1730 22.8637 32.4743 12.9659 4.0497 1.8305 24.7640 144.6735 10.7251 97.1473 18.1193 0.2468 3.1166 0.5614 31.1778 3.9287 30.7262 51.0817 7.5619 18.3811 22.7921 1.9524 100.5268 28.1524 307.2115 30.9524 174.4813 137.4044 45.9019 207.6659 141.1070 41.0790 30.4745 20.1142 8.8051 19.1805 122.9431 51.7599 33.6404 39.3606 62.6798 23.9852 2.6171 10.0415
temp: 298.150 k
press: 1.00000 atm
elementType: 8 7 7 6 6 6 6 6 6 6 6 6 6 6 6 6 1 1 1 1 1 1 1 1 1 1 1 1 1 1 1 1
symmnumber: 1
zpe: 704942.1 jmol-1
zpe.correction: 0.268498 hartree
zpe.thermalcorrener: 0.282091 hartree
zpe.thermalcorrenthalpy: 0.283035 hartree
zpe.thermalcorrgfe: 0.228183 hartree
zpe.sumelectzpe: -688.553515 hartree
zpe.sumelectthermal: -688.539923 hartree
zpe.sumelectthermalent: -688.538979 hartree
zpe.sumelectthermalfe: -688.593831 hartree
dipole: -4.1177 -3.1795 -0.2853
dipole: 5.2102
quadrupole: -94.6752 -84.5410 -97.5184
quadrupole: -16.6892 0.8468 -0.3126
quadrupole: -2.4303 7.7038 -5.2735 -16.6892 0.8468 -0.3126
hfenergy: -688.8220136 hartree
pointgroup: C01 [X(C13H16N2O1)]
dipole: 1.6424618 1.2200259 -0.1252565 debye
polarizability: 239.0158464|-2.0402577|169.1090913|-4.519942|0.6667839|87.3008949 unknown
InChI: InChI=1S/C13H16N2O/c16-9-14-12-7-10-3-1-5-15-6-2-4-11(8-12)13(10)15/h7-9,14H,1-6H2
charge 0 multiplicity 1
32 atoms
O  -4.430535 -0.965075 0.064964
N  2.274627 -0.378008 -0.067695
N  -3.233475 1.076572 0.035959
C  0.906758 -0.031648 -0.069384
C  2.683892 -1.777124 -0.279745
C  3.303614 0.657234 -0.263517
C  -0.105474 -1.047311 -0.057773
C  0.504075 1.344675 -0.060879
C  1.716414 -2.744917 0.426198
C  2.906573 1.968478 0.440237
C  0.283535 -2.52126 -0.098115
C  1.547813 2.455395 -0.102782
C  -1.468954 -0.69616 -0.020069
C  -0.865011 1.666179 -0.021839
C  -1.865148 0.663298 -0.002748
C  -4.379281 0.298316 0.067245
H  3.708318 -1.897827 0.12213
H  2.72685 -2.024255 -1.366948
H  4.256535 0.274466 0.149947
H  3.474879 0.857533 -1.348035
H  1.755589 -2.561191 1.516325
H  2.039512 -3.786873 0.245746
H  3.690411 2.729931 0.271461
H  2.837574 1.78686 1.529154
H  -0.44178 -3.115355 0.487304
H  0.217582 -2.893465 -1.141843
H  1.682749 2.805487 -1.147644
H  1.192773 3.329454 0.47479
H  -2.235494 -1.475033 -0.002898
H  -1.154817 2.727053 -0.005599
H  -3.386825 2.088706 0.044986
H  -5.295376 0.934668 0.095663
