program: Gaussian 09
title: 000293496
version: EM64L-G09RevD.01
frameworkgroup: C1[X(C11H8F6N2O2)]
method: RPBEPBE
basis: SDD
operation: Freq
keyword: #p
keyword: freq=noraman
keyword: PBEPBE/SDD
title: #p freq=noraman PBEPBE/SDD
converged: YES YES NO NO
title: Mulliken charges:
elementType: F F F F F F O O N N C C C C C C C C C C C H H H H H H H H
charge: -0.164536 -0.134581 -0.120538 -0.151384 -0.113260 -0.147154 -0.399593 -0.225087 -0.382893 -0.050695 0.041208 -0.708117 0.484192 0.383088 0.374466 -0.468849 0.047212 0.354331 0.036319 -0.785217 -0.223519 0.292640 0.298020 0.265070 0.384471 0.347388 0.250750 0.256699 0.259568
chargesum: 0.00000
title: Mulliken charges with hydrogens summed into heavy atoms:
elementType: F F F F F F O O N N C C C C C C C C C C C
charge: -0.164536 -0.134581 -0.120538 -0.151384 -0.113260 -0.147154 -0.015122 -0.225087 -0.035505 -0.050695 0.041208 -0.117457 0.484192 0.383088 0.374466 -0.203779 0.047212 0.354331 0.036319 -0.018201 -0.223519
polarizability: 1.68743480e+02 1.62555701e+01 1.70851923e+02 -6.29123489e+00 1.79213090e+01 9.39290168e+01
1716.lowfreq: -2.1526 -0.0006 -0.0003 0.0005 2.9519 6.3834 25.7284 40.4709 52.1412
frequency: 25.6801 40.4236 52.1212 55.6150 75.4426 84.5517 100.4902 129.2741 145.2212 157.1871 169.6380 191.9446 215.3221 247.2114 250.9005 262.5488 267.1273 294.8914 295.3963 312.5581 346.4817 383.6630 407.0260 417.1394 444.4559 457.7191 460.5185 478.8057 492.1938 521.8255 541.8065 560.0290 600.4942 608.4142 620.0678 622.8584 661.3851 694.0823 698.0094 758.3961 789.6879 842.2998 868.7235 903.8251 949.0984 988.8170 995.2596 999.6983 1039.0563 1050.3940 1051.7491 1068.9870 1077.6416 1099.2092 1108.7099 1150.1579 1161.2354 1196.1734 1223.7516 1251.7949 1300.0989 1344.8176 1377.0565 1406.1806 1412.6356 1437.3064 1466.2423 1470.2945 1478.0753 1537.8654 1612.0068 1643.4739 2157.2268 2986.1955 3022.2601 3063.5471 3087.9977 3118.9470 3186.6225 3478.5428 3494.4316
redmass: 10.0440 14.8292 7.6350 8.8356 4.4514 1.2990 7.5125 9.2301 9.0874 11.1953 5.5905 10.8995 5.0936 8.5683 6.9318 7.9864 14.3618 5.0744 8.2997 9.2058 3.4602 1.3147 6.3600 3.8202 7.7440 7.0462 11.0671 8.9320 10.1044 7.1152 7.2353 7.8009 5.8853 5.4263 6.0416 5.4411 9.2543 4.7485 4.9763 2.0734 2.6542 1.7235 2.4319 6.0155 2.8235 8.4712 4.6992 1.8600 7.0579 1.6648 4.2063 4.6449 8.0887 8.1328 5.8362 3.8013 10.5989 1.3115 1.9181 3.4967 1.9129 1.3910 1.6393 1.2664 2.2760 2.4445 1.0428 1.1217 1.3428 7.7344 4.6028 6.8435 12.6041 1.0391 1.0607 1.0978 1.1009 1.0976 1.0935 1.0678 1.0773
irintensity: 1.9719 0.4575 2.2715 2.6386 0.3496 0.0901 1.2151 3.2661 3.6382 3.8154 1.2162 0.6973 4.1355 1.6355 6.3080 1.4004 3.5609 3.9351 9.4390 19.5625 5.7374 195.1321 26.3820 57.8827 1.1837 4.9490 11.5360 3.0931 1.7275 3.9662 2.1022 4.5336 10.9433 8.7862 12.8086 17.5049 1.8059 1.1462 4.1024 52.6454 49.0083 35.4403 29.6336 93.7905 57.8999 39.7513 20.3012 17.2979 82.6883 13.9556 160.7877 128.5012 120.0972 25.2524 38.3922 149.5403 279.3540 40.9562 18.4571 5.2165 4.5697 11.6066 6.2812 28.9543 5.3288 36.7754 17.3674 29.4352 21.4114 63.9885 238.6404 447.3695 57.3543 12.8294 0.6231 7.6436 0.7239 7.6586 1.0427 106.1170 62.0301
temp: 298.150 k
press: 1.00000 atm
elementType: 9 9 9 9 9 9 8 8 7 7 6 6 6 6 6 6 6 6 6 6 6 1 1 1 1 1 1 1 1
symmnumber: 1
zpe: 478787.5 jmol-1
zpe.correction: 0.182361 hartree
zpe.thermalcorrener: 0.202682 hartree
zpe.thermalcorrenthalpy: 0.203626 hartree
zpe.thermalcorrgfe: 0.132633 hartree
zpe.sumelectzpe: -1281.421967 hartree
zpe.sumelectthermal: -1281.401646 hartree
zpe.sumelectthermalent: -1281.400702 hartree
zpe.sumelectthermalfe: -1281.471695 hartree
dipole: -4.4512 -6.4341 -3.6504
dipole: 8.6335
quadrupole: -115.6016 -131.1285 -121.9408
quadrupole: 24.0918 4.0626 -0.6825
quadrupole: 7.2887 -8.2382 0.9495 24.0918 4.0626 -0.6825
hfenergy: -1281.6043279 hartree
pointgroup: C01 [X(C11H8F6N2O2)]
dipole: -1.4956123 2.675743 1.463167 debye
polarizability: 165.6619785|-15.7879983|173.6429282|7.7233884|17.9791167|94.2195127 unknown
InChI: InChI=1S/C11H8F6N2O2/c1-5-2-6(7(4-18)8(20)19-5)3-9(21,10(12,13)14)11(15,16)17/h2,19,21H,3H2,1H3
charge 0 multiplicity 1
29 atoms
F  1.77525 2.206166 0.166333
F  0.544646 1.441219 -1.576838
F  2.794203 1.342217 -1.662419
F  2.888407 -1.887458 1.101661
F  4.062808 -0.665781 -0.390468
F  3.375919 0.28898 1.546343
O  1.373221 -1.129841 -1.234196
O  -3.964661 -1.513074 -0.719876
N  -3.518861 0.673582 -0.028563
N  -0.725909 -3.352627 -0.257305
C  1.621455 -0.226838 -0.141812
C  0.551776 -0.256164 1.006724
C  -0.884179 0.056289 0.609427
C  1.693634 1.181602 -0.816008
C  3.004858 -0.601805 0.512239
C  -1.398042 1.374258 0.808487
C  -1.727063 -0.950358 0.096189
C  -2.719316 1.676749 0.480059
C  -3.129049 -0.685438 -0.259139
C  -3.338959 3.042021 0.640109
C  -1.230357 -2.276827 -0.101644
H  0.878841 0.452804 1.785711
H  0.599838 -1.270296 1.443459
H  -0.75377 2.1612 1.204306
H  1.032857 -2.009128 -0.91409
H  -4.494479 0.871164 -0.279726
H  -4.219963 3.00768 1.308202
H  -3.67243 3.444125 -0.334981
H  -2.613072 3.749778 1.067521
