program: Gaussian 09
title: 000293470
version: EM64L-G09RevD.01
frameworkgroup: C1[X(C11H13N3O2)]
method: RPBEPBE
basis: SDD
operation: Freq
keyword: #p
keyword: freq=noraman
keyword: PBEPBE/SDD
title: #p freq=noraman PBEPBE/SDD
converged: NO YES NO NO
title: Mulliken charges:
elementType: O O N N N C C C C C C C C C C C H H H H H H H H H H H H H
charge: -0.306343 -0.264588 -0.437807 -0.157308 -0.439429 -0.304346 -0.463473 0.472851 0.222692 0.505589 -0.459185 -0.334537 -0.335211 -0.469750 0.206695 -0.800639 0.229515 0.229525 0.231556 0.231557 0.330308 0.222439 0.319041 0.308834 0.215708 0.307628 0.235476 0.267914 0.235286
chargesum: 0.00000
title: Mulliken charges with hydrogens summed into heavy atoms:
elementType: O O N N N C C C C C C C C C C C
charge: -0.306343 -0.264588 -0.107498 -0.157308 -0.131800 0.154694 -0.000360 0.472851 0.222692 0.505589 -0.236746 -0.015495 -0.026377 -0.254042 0.206695 -0.061964
polarizability: 2.72783569e+02 5.30075527e+00 1.41351023e+02 -1.45655553e-03 2.71046569e-02 7.21083423e+01
1716.lowfreq: -80.3184 -0.0008 0.0005 0.0007 4.4543 6.8163 20.4585 34.5345 55.8450
frequency: -80.3153 34.5329 55.7257 60.0419 84.4921 85.0031 86.7134 153.5209 175.1209 247.9159 253.1069 281.5518 364.8257 379.5851 384.5988 415.0183 525.8642 527.8316 554.5441 581.6990 627.5888 636.9763 639.3898 648.2753 702.7371 726.0000 751.6046 800.9167 819.9417 836.5735 844.8485 849.6287 869.9694 920.6715 930.0714 957.3701 974.1598 984.8382 984.9975 988.5211 1008.3842 1029.2487 1082.9211 1127.0632 1158.5404 1186.3147 1194.4105 1200.8702 1220.4769 1250.8031 1276.1499 1300.5810 1309.5850 1324.8988 1369.9028 1375.0591 1423.3984 1449.5654 1468.8765 1478.3364 1490.4721 1497.1423 1508.8513 1537.7270 1601.5533 1628.4173 1636.7805 1672.7080 2987.2780 3002.9035 3030.6344 3049.9951 3072.3094 3101.6783 3109.9617 3118.6380 3136.4699 3164.0894 3195.3895 3521.7731 3561.0813
redmass: 1.0496 5.4706 2.0423 4.9099 4.5072 4.8567 4.5294 5.9299 4.5008 5.5162 4.2708 5.7755 5.1626 4.4062 4.4035 3.0748 2.1351 4.6216 1.3432 3.0524 6.9069 6.2352 1.2017 5.5741 7.3863 3.6867 7.1898 4.7654 1.1608 1.2926 5.5070 1.6398 8.5285 3.6948 6.5895 7.8385 1.3063 1.7298 1.3137 5.3257 2.5447 1.6498 1.5714 1.3271 1.0975 2.4231 1.3852 1.1024 3.1219 1.7754 1.8957 1.2924 1.3766 1.6475 3.6610 1.3032 3.7245 1.1557 1.0469 1.1000 1.1424 1.9864 2.2719 2.2362 4.7306 4.8946 6.3267 9.4985 1.0383 1.0584 1.0578 1.1076 1.0984 1.1115 1.0905 1.0911 1.0978 1.0953 1.0944 1.0764 1.0759
irintensity: 0.0080 0.0058 6.7984 5.2276 2.8945 4.0606 0.0901 3.0216 1.4143 2.1069 10.4473 1.6377 6.1616 0.6879 14.1855 0.0249 76.7748 2.9489 33.8809 0.5938 1.6302 43.6008 52.3708 3.0224 10.9703 0.0868 14.7484 2.7204 0.3196 2.2345 2.4843 115.9508 8.6029 72.3338 6.4167 96.5161 0.1026 38.6972 4.8161 84.2008 0.7318 7.9088 0.0208 40.0303 0.5123 24.5195 14.3296 0.1096 39.5724 81.2590 0.7459 21.4044 8.5607 15.1086 278.0608 106.6279 79.5506 30.8995 19.3336 3.1304 1.4433 54.3993 42.5802 855.7386 15.9128 210.8994 28.9214 585.6487 11.2540 64.7896 87.5058 13.2099 16.8930 40.5720 26.3181 13.4669 8.0864 12.6362 5.3860 11.2208 46.0598
temp: 298.150 k
press: 1.00000 atm
elementType: 8 8 7 7 7 6 6 6 6 6 6 6 6 6 6 6 1 1 1 1 1 1 1 1 1 1 1 1 1
symmnumber: 1
zpe: 601769.5 jmol-1
zpe.correction: 0.229202 hartree
zpe.thermalcorrener: 0.243455 hartree
zpe.thermalcorrenthalpy: 0.244399 hartree
zpe.thermalcorrgfe: 0.186379 hartree
zpe.sumelectzpe: -740.508581 hartree
zpe.sumelectthermal: -740.494327 hartree
zpe.sumelectthermalent: -740.493383 hartree
zpe.sumelectthermalfe: -740.551403 hartree
dipole: -2.2208 -2.8959 0.0067
dipole: 3.6494
quadrupole: -73.2907 -88.9570 -96.8526
quadrupole: -16.1076 0.0206 -0.0031
quadrupole: 13.0760 -2.5902 -10.4858 -16.1076 0.0206 -0.0031
hfenergy: -740.7377826 hartree
pointgroup: C01 [X(C11H13N3O2)]
dipole: 0.880003 -1.1342968 -0.0213836 debye
polarizability: 272.7873834|-4.6561832|141.2438225|3.0752011|1.8995249|72.2117285 unknown
InChI: InChI=1S/C11H13N3O2/c1-8(15)13-9-2-4-10(5-3-9)14-11-12-6-7-16-11/h2-5,13-14H,6-7H2,1H3
charge 0 multiplicity 1
29 atoms
O  4.292596 1.053164 0.13405
O  -4.675759 1.234499 -0.002636
N  1.974582 0.978874 0.096996
N  3.290942 -1.071406 0.058138
N  -3.439042 -0.762168 -0.038757
C  5.442561 0.095434 0.124219
C  4.765293 -1.321128 0.073328
C  0.633364 0.515319 0.062892
C  3.127501 0.227393 0.09288
C  -2.095004 -0.285349 -0.002756
C  -0.408289 1.479469 0.073444
C  0.301797 -0.864316 0.01932
C  -1.760709 1.094832 0.041293
C  -1.05097 -1.247338 -0.012796
C  -4.628053 -0.031246 -0.037242
C  -5.885638 -0.902341 -0.089569
H  6.026488 0.271157 1.042454
H  6.054156 0.322904 -0.764152
H  5.055794 -1.883577 -0.832191
H  5.028528 -1.934649 0.953672
H  2.12301 1.988634 0.128413
H  -0.162255 2.548554 0.107525
H  1.105097 -1.605505 0.011342
H  -2.559017 1.838463 0.049454
H  -1.296108 -2.317338 -0.046804
H  -3.537087 -1.780004 -0.071161
H  -5.909348 -1.521982 -1.005329
H  -6.765458 -0.243435 -0.087028
H  -5.945372 -1.577113 0.784602
