program: Gaussian 09
title: 000293469
version: EM64L-G09RevD.01
frameworkgroup: C1[X(C8H15N3O)]
method: RPBEPBE
basis: SDD
operation: Freq
keyword: #p
keyword: freq=noraman
keyword: PBEPBE/SDD
title: #p freq=noraman PBEPBE/SDD
converged: NO YES NO NO
title: Mulliken charges:
elementType: O N N N C C C C C C C C H H H H H H H H H H H H H H H
charge: -0.310658 -0.012928 -0.368648 -0.095627 -0.400688 -0.386821 -0.386470 -0.376905 -0.377543 0.239669 -0.297418 -0.463168 0.188623 0.217379 0.218905 0.195466 0.195496 0.218576 0.237532 0.171049 0.170671 0.237359 0.291731 0.222874 0.222766 0.224350 0.224427
chargesum: 0.00000
title: Mulliken charges with hydrogens summed into heavy atoms:
elementType: O N N N C C C C C C C C
charge: -0.310658 -0.012928 -0.076917 -0.095627 0.005314 0.027549 0.027602 0.031677 0.030488 0.239669 0.148222 -0.014392
polarizability: 1.41728583e+02 -4.93213970e-01 8.89121784e+01 -3.69582444e+00 1.36143804e+00 9.75044910e+01
1716.lowfreq: -19.2877 -13.7924 -3.5230 0.0005 0.0007 0.0009 10.5565 31.0504 50.0402
frequency: -9.5862 30.2118 49.8665 65.1244 175.6163 197.7576 226.1482 279.8559 306.4165 374.4731 388.2846 445.3470 467.2114 475.0579 571.5726 631.2761 699.0585 732.0490 769.2543 801.3750 816.7627 850.2711 852.3625 865.6852 910.9387 912.9447 947.1797 961.1611 981.3483 1006.3743 1044.9573 1073.8892 1083.3774 1100.6445 1116.5793 1149.5100 1155.1477 1156.5374 1198.9347 1215.9917 1238.2392 1260.7278 1264.1163 1280.5248 1300.9358 1308.8396 1327.6166 1340.3575 1347.3495 1351.1388 1363.1270 1451.0084 1460.4557 1462.8874 1465.1030 1474.6327 1477.9955 1490.2579 1507.1855 1694.5087 2835.1175 2846.4790 2967.6379 2992.7263 2993.1223 2995.0475 3022.0865 3038.0664 3039.8767 3052.1569 3057.7309 3058.4547 3064.3189 3091.3577 3423.2396
redmass: 3.6969 2.3603 3.7906 3.8223 2.8761 3.7978 1.7985 4.9633 2.6040 1.8246 3.1853 1.8592 2.5530 1.6833 2.1819 8.4897 6.6869 6.9517 4.1707 1.4459 1.1592 2.8784 2.2599 2.5473 2.2355 3.7392 7.3178 1.3002 5.6876 2.5017 2.0304 1.3983 1.5633 2.7825 2.6179 1.2733 1.0977 2.7995 1.1037 2.4492 2.1624 1.2792 1.2426 1.4044 1.2612 1.3271 1.2750 1.4003 1.4831 1.4337 1.4068 1.0893 1.0870 1.1111 1.0794 1.1172 1.0929 1.0859 1.5376 10.2534 1.0716 1.0699 1.0636 1.0620 1.0600 1.0582 1.0577 1.0961 1.1077 1.0989 1.0931 1.0940 1.0991 1.1113 1.0754
irintensity: 1.8700 0.0227 2.7538 1.5861 1.7774 5.3472 3.2495 3.9292 3.2890 2.1660 3.1637 25.7071 1.2268 80.7820 4.7527 4.7827 14.9574 5.4133 12.3752 0.0710 0.3572 12.3199 10.8541 3.5237 6.9220 45.2213 51.7839 2.6070 105.5890 20.7977 10.7040 3.8728 0.0331 14.3256 2.8692 3.6383 0.4539 29.7418 0.0547 29.8170 4.4734 3.1383 11.4023 5.2731 7.7335 34.4762 3.4415 0.4771 1.2030 0.8915 3.4221 8.0202 16.4354 3.5388 0.7970 4.5659 1.4291 0.1159 62.6723 492.1964 42.3281 166.9197 42.1336 20.0806 44.0867 68.7040 84.3214 60.4297 14.1776 53.4384 9.7686 12.7471 78.5750 48.3931 49.8067
temp: 298.150 k
press: 1.00000 atm
elementType: 8 7 7 7 6 6 6 6 6 6 6 6 1 1 1 1 1 1 1 1 1 1 1 1 1 1 1
symmnumber: 1
zpe: 606692.0 jmol-1
zpe.correction: 0.231077 hartree
zpe.thermalcorrener: 0.242009 hartree
zpe.thermalcorrenthalpy: 0.242953 hartree
zpe.thermalcorrgfe: 0.192989 hartree
zpe.sumelectzpe: -552.316298 hartree
zpe.sumelectthermal: -552.305365 hartree
zpe.sumelectthermalent: -552.304421 hartree
zpe.sumelectthermalfe: -552.354386 hartree
dipole: 0.5677 -0.1923 -1.5796
dipole: 1.6895
quadrupole: -58.6870 -70.5733 -75.4666
quadrupole: -0.4051 -3.0285 -0.6615
quadrupole: 9.5553 -2.3310 -7.2243 -0.4051 -3.0285 -0.6615
hfenergy: -552.5473743 hartree
pointgroup: C01[X(C8H15N3O1)]
dipole: -0.1970258 0.1798268 -0.6088328 debye
polarizability: 141.3323917|-0.9442135|89.6131378|5.5149809|-2.7609455|97.1997233 unknown
InChI: InChI=1S/C8H15N3O/c1-2-5-11(6-3-1)10-8-9-4-7-12-8/h10H,1-7H2
charge 0 multiplicity 1
27 atoms
O  2.722914 0.353708 -0.908339
N  -0.854832 0.074932 -0.189262
N  0.411289 0.275774 -0.785286
N  1.780433 -0.309922 1.146701
C  -3.763451 -0.050766 0.053255
C  -2.896354 -1.327116 -0.042315
C  -2.942433 1.105364 0.670051
C  -1.59488 -1.050387 -0.822864
C  -1.639831 1.337082 -0.123311
C  1.580458 0.075298 -0.084152
C  3.899732 0.094269 -0.023703
C  3.263886 -0.346837 1.344418
H  -4.105971 0.239813 -0.961973
H  -4.670111 -0.245021 0.656298
H  -2.629321 -1.671072 0.974874
H  -3.451753 -2.144798 -0.540109
H  -3.530889 2.042536 0.686159
H  -2.677366 0.855225 1.714775
H  -0.934084 -1.933932 -0.812201
H  -1.844397 -0.817017 -1.891526
H  -1.892409 1.708737 -1.151532
H  -1.010321 2.097918 0.368879
H  0.490329 0.576368 -1.765596
H  4.479203 1.030465 0.042268
H  4.507253 -0.693212 -0.500519
H  3.575589 -1.368216 1.630257
H  3.547216 0.33571 2.166558
