program: Gaussian 09
title: 000293503
version: EM64L-G09RevD.01
frameworkgroup: C1[X(C12H8F12N2O2)]
method: RPBEPBE
basis: SDD
operation: Freq
keyword: #p
keyword: freq=noraman
keyword: PBEPBE/SDD
title: #p freq=noraman PBEPBE/SDD
converged: YES YES NO NO
title: Mulliken charges:
elementType: F F F F F F F F F F F F O O N N C C C C C C C C C C C C H H H H H H H H
charge: -0.113734 -0.126526 -0.166165 -0.137367 -0.123200 -0.145228 -0.130200 -0.124213 -0.166774 -0.142254 -0.147728 -0.117114 -0.407268 -0.407404 0.007062 0.025643 0.032111 0.024475 -0.606031 -0.591954 0.242839 0.197884 0.356640 0.384939 0.370308 0.385405 -0.369143 -0.447506 0.304786 0.262655 0.295653 0.271762 0.253515 0.291244 0.376206 0.386680
chargesum: 0.00000
title: Mulliken charges with hydrogens summed into heavy atoms:
elementType: F F F F F F F F F F F F O O N N C C C C C C C C C C C C
charge: -0.113734 -0.126526 -0.166165 -0.137367 -0.123200 -0.145228 -0.130200 -0.124213 -0.166774 -0.142254 -0.147728 -0.117114 -0.031062 -0.020724 0.007062 0.025643 0.032111 0.024475 -0.038590 -0.024538 0.242839 0.197884 0.356640 0.384939 0.370308 0.385405 -0.115628 -0.156262
polarizability: 1.97626877e+02 -8.41577141e+00 1.37177804e+02 -1.32904419e+01 -1.30866357e+01 1.28169056e+02
1716.lowfreq: -4.8061 -0.0003 -0.0003 0.0008 3.2673 7.8839 13.1306 20.0404 23.7029
frequency: 12.1579 19.6311 23.5029 34.9226 43.4958 45.8176 53.4827 69.1992 75.6077 100.8405 122.5615 148.4743 153.6006 171.7495 182.0439 189.7865 201.5775 241.3095 249.0093 256.6767 259.8010 269.0316 271.7054 278.7465 294.2584 298.1529 304.7965 308.0748 321.5503 324.6525 337.0718 392.7091 399.8866 410.2844 449.0140 454.8264 460.4935 461.0725 472.2081 484.7292 488.8996 498.4656 545.9244 556.1202 586.5348 587.9212 600.7513 610.8789 642.4116 647.0409 680.4939 705.3537 742.4234 772.2329 839.7078 844.0997 883.2048 894.4882 907.0431 938.5107 963.2335 972.2255 979.0011 984.8278 1002.2049 1010.5353 1041.6011 1044.4278 1060.4837 1066.3712 1068.3072 1073.4237 1098.6378 1101.1548 1125.2117 1140.8501 1141.7389 1155.8673 1168.6585 1201.5173 1229.4369 1245.9728 1271.5783 1288.9678 1306.7433 1336.1938 1361.8414 1373.0578 1410.1728 1414.3264 1449.9149 1450.3403 1517.8131 1532.9282 3014.3993 3038.9954 3093.3352 3108.4214 3138.9728 3160.3707 3539.8743 3549.1944
redmass: 12.1442 14.6612 13.5168 12.9460 11.8444 17.4413 9.0882 12.6150 13.5881 7.3996 11.5384 10.6448 13.2647 6.6964 5.6504 8.6344 9.0822 5.2008 6.6029 6.3872 5.7786 10.4473 1.6838 13.1534 10.5464 14.5945 8.5913 1.2023 6.1080 6.4169 2.4803 3.2030 10.7812 6.6741 7.0404 6.6525 16.9255 16.7422 11.7457 12.3469 16.4429 8.4316 11.2926 9.0264 8.4846 7.7000 6.5027 8.9972 11.2772 11.4197 9.6806 6.2441 6.7280 2.5887 3.2920 3.9210 3.1467 2.3491 2.9270 1.5867 4.3216 5.8346 4.1551 4.1182 6.0338 6.1096 9.7242 10.4258 9.6340 9.9086 11.4620 7.1596 8.4310 8.4720 2.8529 3.9443 2.8280 5.0626 4.7737 1.6147 3.2270 1.9427 1.9585 1.8030 1.5565 1.5113 1.6633 1.7121 2.3910 2.4317 1.0905 1.1002 8.5409 4.6350 1.0623 1.0593 1.0991 1.1033 1.0927 1.0938 1.0660 1.0662
irintensity: 0.4308 0.1427 0.5876 0.1525 0.2066 0.1738 0.7992 0.1305 1.3490 3.4615 1.0492 2.7671 0.6464 5.8467 5.8874 1.4885 9.7061 2.3624 30.8533 11.4461 44.3900 10.7615 164.0816 3.6193 4.0517 1.0351 2.8994 132.6913 27.0874 9.2222 4.1672 9.3990 8.6670 2.6279 17.8657 8.7636 6.0135 2.4332 6.5722 0.0541 0.7328 0.2068 6.0638 3.3374 5.7684 36.9364 55.3697 1.0798 17.5644 16.1839 1.5178 4.9651 1.5611 17.8245 75.7118 27.4230 49.1150 53.8311 49.6379 0.2629 51.6405 72.1232 74.8975 121.4057 40.9867 19.6867 31.3941 100.8629 241.0905 45.4573 150.3775 334.9876 101.1849 102.4608 184.9305 151.8685 25.9916 372.3665 143.3014 24.6247 5.7152 31.9235 2.4560 2.5424 37.6710 5.8114 11.7135 20.5349 59.4700 9.0500 35.6399 7.9114 36.2848 6.5923 2.5334 0.3759 0.6545 1.2441 11.9485 11.9658 25.5818 46.8188
temp: 298.150 k
press: 1.00000 atm
elementType: 9 9 9 9 9 9 9 9 9 9 9 9 8 8 7 7 6 6 6 6 6 6 6 6 6 6 6 6 1 1 1 1 1 1 1 1
symmnumber: 1
zpe: 537447.2 jmol-1
zpe.correction: 0.204703 hartree
zpe.thermalcorrener: 0.232048 hartree
zpe.thermalcorrenthalpy: 0.232993 hartree
zpe.thermalcorrgfe: 0.143827 hartree
zpe.sumelectzpe: -1917.980893 hartree
zpe.sumelectthermal: -1917.953547 hartree
zpe.sumelectthermalent: -1917.952603 hartree
zpe.sumelectthermalfe: -1918.041769 hartree
dipole: 2.2224 0.7650 -3.0072
dipole: 3.8167
quadrupole: -179.9983 -166.4102 -154.6211
quadrupole: -5.2023 -11.9011 0.7138
quadrupole: -12.9884 0.5996 12.3888 -5.2023 -11.9011 0.7138
hfenergy: -1918.1855956 hartree
pointgroup: C01[X(C12H8F12N2O2)]
dipole: -0.8886628 -0.9793548 -0.7113175 debye
polarizability: 198.5046737|2.0910557|146.4733637|13.1322599|-1.3577642|117.995699 unknown
InChI: InChI=1S/C12H8F12N2O2/c13-9(14,15)7(27,10(16,17)18)1-5-3-25-4-6(26-5)2-8(28,11(19,20)21)12(22,23)24/h3-4,27-28H,1-2H2
charge 0 multiplicity 1
36 atoms
F  -5.818473 0.805816 -0.010764
F  -4.191649 1.938898 -1.097881
F  -4.966127 -0.032427 -1.931901
F  -2.315102 -0.445597 2.110998
F  -4.418737 0.34646 2.246035
F  -2.776536 1.662832 1.406053
F  2.420615 1.866916 -1.17581
F  4.1715 0.941406 -2.26181
F  2.20277 -0.16902 -2.166028
F  5.030801 -0.063299 1.787852
F  4.519138 1.914672 0.800983
F  5.908946 0.443183 -0.224397
O  -4.027839 -1.538171 0.195842
O  3.934173 -1.442477 -0.461361
N  0.028813 -0.216061 0.039371
N  0.020149 -3.054152 0.178224
C  -3.527349 -0.188871 0.002238
C  3.493557 -0.107694 -0.109731
C  -2.236805 -0.134604 -0.876163
C  2.322291 -0.090127 0.929525
C  -1.058762 -0.938778 -0.35957
C  1.113962 -0.902927 0.510289
C  -4.628903 0.661288 -0.723926
C  -3.270947 0.340622 1.446629
C  3.088918 0.659195 -1.419111
C  4.752501 0.542563 0.546307
C  -1.039493 -2.359924 -0.322697
C  1.086478 -2.319151 0.613096
H  -1.903465 0.911957 -0.973705
H  -2.525393 -0.496206 -1.881091
H  2.006199 0.950057 1.110352
H  2.734848 -0.503037 1.865758
H  -1.885205 -2.954176 -0.678602
H  1.915339 -2.876639 1.062525
H  -4.43045 -1.870528 -0.648436
H  3.197738 -1.932493 -0.912491
