program: Gaussian 09
title: 000293466
version: EM64L-G09RevD.01
frameworkgroup: C1[X(C10H12BrNO2)]
method: RPBEPBE
basis: SDD
operation: Freq
keyword: #p
keyword: freq=noraman
keyword: PBEPBE/SDD
title: #p freq=noraman PBEPBE/SDD
converged: YES YES NO NO
title: Mulliken charges:
elementType: Br O O N C C C C C C C C C C H H H H H H H H H H H H
charge: -0.032175 -0.296615 -0.267973 -0.341978 -0.347978 -0.437881 0.197360 0.372034 -0.627835 -0.337105 -0.383303 -0.224486 -0.193064 -0.255300 0.267541 0.256360 0.245979 0.264918 0.360384 0.283203 0.296214 0.255493 0.255299 0.228593 0.230982 0.231330
chargesum: 0.00000
title: Mulliken charges with hydrogens summed into heavy atoms:
elementType: Br O O N C C C C C C C C C C
charge: -0.032175 -0.296615 -0.267973 0.018406 0.175924 0.073017 0.197360 0.372034 -0.048418 -0.081612 -0.128004 0.004107 0.037918 -0.023969
polarizability: 1.34798023e+02 -1.16501523e+01 1.47316837e+02 -1.87452206e+01 -1.21975999e+01 1.05691636e+02
1716.lowfreq: -0.0005 0.0004 0.0008 2.5905 6.9126 8.5890 12.5289 37.5991 41.1081
frequency: 11.7638 37.5805 41.0877 47.1306 66.2124 119.0504 160.9665 189.5905 247.4010 268.7959 326.2978 356.0056 411.0583 442.7986 499.9287 508.9598 527.9747 550.2533 567.9983 610.6374 650.1194 682.1282 693.3660 756.6328 758.7265 791.5441 828.4595 894.1851 897.3599 963.9821 964.9608 981.5030 986.0618 990.1811 1005.0292 1016.0101 1025.4643 1085.7456 1116.1313 1158.8932 1167.2452 1180.6772 1192.5863 1217.1436 1234.5204 1245.7105 1296.9942 1316.8514 1327.2141 1366.4848 1386.7287 1433.9952 1438.6439 1441.6366 1455.4854 1474.3406 1503.5854 1594.4845 1609.4519 1622.5019 2997.0857 3022.4383 3058.3418 3067.7023 3090.9014 3131.1478 3139.7284 3152.6404 3155.4753 3163.4463 3173.7259 3524.6563
redmass: 7.8040 4.5109 5.2962 7.1645 6.1657 3.3092 5.2166 5.8808 3.8068 3.7189 2.8596 4.0577 2.9362 2.7910 3.5308 4.2201 3.6440 4.8359 4.5946 6.3508 3.7359 1.1308 2.1819 4.7921 1.6022 2.1952 1.2458 2.2040 1.4520 2.6708 1.3676 5.2145 1.3081 4.9929 2.1619 1.7897 2.0290 1.5452 3.9770 1.3395 1.1395 1.4968 1.4515 1.3046 1.3470 1.7597 1.1887 1.3217 1.2708 1.3168 8.5715 1.1022 1.0996 2.0425 1.1476 2.1793 2.0379 6.2770 6.3900 7.9872 1.0599 1.0582 1.0727 1.0857 1.1057 1.0849 1.0889 1.1113 1.0925 1.0960 1.1010 1.0775
irintensity: 0.6890 0.2265 0.3912 4.7798 6.7542 1.9037 7.3447 4.7477 5.1520 9.7902 19.2116 9.9933 0.0115 3.8251 5.0325 6.3291 12.4714 5.2166 15.2417 1.6611 18.6638 161.4783 26.4380 13.5044 94.4094 19.9024 0.1394 5.1421 8.8577 22.7307 0.0669 15.8033 0.6813 33.0663 6.6848 7.4515 22.2006 12.7229 9.0959 9.3815 21.0325 92.2635 41.1932 20.6155 87.3544 56.0851 35.9763 1.9293 5.8215 12.0278 6.3867 8.5052 35.3849 5.5210 33.0102 124.4582 174.2771 24.1017 66.5692 196.6260 25.5826 21.0913 9.1759 13.5214 7.8866 1.7202 9.8096 7.7302 25.1638 15.5891 7.2382 38.4551
temp: 298.150 k
press: 1.00000 atm
elementType: 35 8 8 7 6 6 6 6 6 6 6 6 6 6 1 1 1 1 1 1 1 1 1 1 1 1
symmnumber: 1
zpe: 534859.6 jmol-1
zpe.correction: 0.203717 hartree
zpe.thermalcorrener: 0.217536 hartree
zpe.thermalcorrenthalpy: 0.218480 hartree
zpe.thermalcorrgfe: 0.158644 hartree
zpe.sumelectzpe: -605.880306 hartree
zpe.sumelectthermal: -605.866487 hartree
zpe.sumelectthermalent: -605.865543 hartree
zpe.sumelectthermalfe: -605.925380 hartree
dipole: 0.8192 -0.8468 -1.0693
dipole: 1.5911
quadrupole: -88.9277 -99.5983 -87.7677
quadrupole: -6.4826 -0.0625 0.2180
quadrupole: 3.1702 -7.5004 4.3302 -6.4826 -0.0625 0.2180
hfenergy: -606.0840232 hartree
pointgroup: C01 [X(C10H12Br1N1O2)]
dipole: 0.3838727 -0.4304231 -0.2433937 debye
dipolederiv: -0.1978674 0.0050893 -0.0016984 -0.0695767 -0.2543802 0.1765239 0.1186028 0.1654659 -0.4025344 -1.4396923 0.4760545 0.1339647 0.6020552 -0.6206948 -0.1127418 0.2392955 -0.2010128 -0.3865459 -0.6301992 0.1923267 -0.1849422 -0.1237794 -0.8290164 0.1784181 -0.1984709 0.4043994 -0.5962275 -0.8096866 -0.2910967 0.1264476 -0.3392514 -1.0209389 0.1354278 0.0032562 0.0080084 -0.3987544 0.5257311 0.2733825 -0.0768264 0.099588 0.1761032 0.1600634 0.2380463 0.3705842 -0.0070872 0.5821844 -0.2287796 -0.0384189 -0.464748 0.3978525 -0.0247988 0.1373677 -0.1755845 0.1195745 0.647387 0.0875819 0.240005 0.4569255 1.3863068 -0.4106918 0.2646496 -0.4956189 0.563243 1.1173979 -0.4635948 -0.273329 -0.5465585 0.3368283 0.1590759 -0.5981164 0.2976891 0.2256635 0.05166 -0.0362941 0.0002858 0.0509072 0.3127934 -0.3383907 -0.0979283 -0.4103753 0.5832549 -0.2474608 0.0170957 0.027517 -0.0610864 -0.162059 -0.0022528 0.2982506 -0.1599691 -0.1588018 -0.3376214 0.0489017 0.0565266 0.1397858 -0.2234536 -0.1017231 -0.0699234 0.0009755 0.0417251 0.043074 -0.1248467 0.0073375 -0.1208462 -0.0348871 -0.0800337 -0.0884124 -0.0273042 0.1369032 0.0530008 -0.1274934 -0.0346468 -0.139157 -0.025717 -0.0410383 -0.0146175 -0.0689512 0.1165774 -0.0875933 -0.0707159 -0.0908942 -0.0604653 -0.1467824 0.0537145 -0.0515549 0.0330846 -0.150323 0.0379053 -0.0662924 0.0735313 0.0731642 0.1349237 0.0902161 -0.0533033 0.0104078 0.0242796 -0.0124492 0.0127191 0.0407777 0.0018866 -0.0865405 -0.0925961 -0.0357619 -0.075855 0.1128288 -0.0358593 -0.0689757 0.0253925 -0.01344 0.0196231 0.0408566 -0.0132184 0.1425079 0.0402152 -0.0158756 0.0780832 0.0369249 0.0712128 0.0504218 -0.0323525 0.0163148 -0.0779573 0.012448 0.4116665 -0.0361369 -0.0891429 0.0430507 0.154107 0.0252662 -0.0971198 0.001101 0.2131971 -0.0364966 -0.0833872 -0.0554021 -0.0758067 0.0178653 0.0378338 -0.0816917 0.0346321 -0.063382 0.0902292 0.0314495 0.0149526 0.0722428 -0.0760924 0.0146973 0.0351077 0.0662972 -0.0247486 0.0611166 0.1030978 -0.0506317 0.1105435 0.07879 0.0528953 -0.0754208 0.0519315 0.0641232 0.1250613 0.0250928 0.0531397 0.0311325 0.140604 0.0197479 0.0451762 0.0237414 -0.0464771 0.0964137 0.031018 0.0355327 0.0319304 0.1216559 0.0397514 0.0593859 0.0313696 -0.1011537 0.0254272 0.1037035 -0.0572613 0.1114572 0.0575961 0.0786225 -0.06313 0.0785533 0.0292704 -0.017453 0.1120174 0.0808584 0.1188333 0.0950912 -0.0264911 0.0832164 -0.0281207 0.0527317 unknown
polarizability: 140.505133|-20.1918045|116.5554799|-6.3695088|-22.3309596|130.7458824 unknown
InChI: InChI=1S/C10H12BrNO2/c11-6-7-12-10(13)8-14-9-4-2-1-3-5-9/h1-5,12H,6-8H2
charge 0 multiplicity 1
26 atoms
Br -3.974577 -1.908786 1.80113
O  0.418762 1.001973 1.473903
O  -2.036739 2.137852 -1.019635
N  -1.819504 0.121667 0.148101
C  -2.863033 -0.583012 -0.599424
C  -0.386439 2.016889 0.783539
C  -1.482417 1.428642 -0.12502
C  1.489879 0.406973 0.758529
C  -4.184462 -0.7138 0.164414
C  1.730402 0.596913 -0.623425
C  2.331356 -0.425941 1.533387
C  2.834046 -0.056512 -1.221673
C  3.423106 -1.07259 0.919719
C  3.682546 -0.890195 -0.460916
H  -3.059677 0.012638 -1.512606
H  -2.498822 -1.580715 -0.903065
H  0.236939 2.706313 0.186686
H  -0.869904 2.591004 1.592507
H  -1.323716 -0.357524 0.905382
H  -4.960369 -1.204784 -0.442426
H  -4.538228 0.250438 0.557164
H  1.078666 1.224655 -1.23893
H  2.118947 -0.54664 2.600178
H  3.022256 0.088546 -2.291287
H  4.07475 -1.715651 1.521416
H  4.532933 -1.391752 -0.934248
