program: Gaussian 09
title: 000293454
version: EM64L-G09RevD.01
frameworkgroup: C1[X(C13H8ClF6N)]
method: RPBEPBE
basis: SDD
operation: Freq
keyword: #p
keyword: freq=noraman
keyword: PBEPBE/SDD
title: #p freq=noraman PBEPBE/SDD
converged: YES YES NO NO
title: Mulliken charges:
elementType: Cl F F F F F F N C C C C C C C C C C C C C H H H H H H H H
charge: 0.076044 -0.129610 -0.132419 -0.132365 -0.138687 -0.140345 -0.117693 -0.019843 -0.354250 -0.548106 0.179759 0.443018 0.450744 -0.319730 -0.098828 0.425377 -0.306999 -0.322334 -0.387176 -0.218531 -0.245473 0.290649 0.276419 0.249305 0.246322 0.267813 0.237354 0.236053 0.233534
chargesum: 0.00000
title: Mulliken charges with hydrogens summed into heavy atoms:
elementType: Cl F F F F F F N C C C C C C C C C C C C C
charge: 0.076044 -0.129610 -0.132419 -0.132365 -0.138687 -0.140345 -0.117693 -0.019843 -0.354250 0.018962 0.179759 0.443018 0.450744 -0.070425 -0.098828 0.425377 -0.060677 -0.054521 -0.149822 0.017522 -0.011940
polarizability: 2.26196908e+02 -2.16947996e+01 1.56991272e+02 1.37693687e+01 1.86584429e+01 9.79174061e+01
1716.lowfreq: -15.8415 -5.4869 -5.2061 -0.0025 -0.0021 -0.0019 18.1501 33.5893 44.8235
frequency: 17.7061 33.4245 44.8092 52.4816 86.7044 120.1893 142.7056 147.8380 179.5019 183.8137 194.7871 219.3891 271.5155 282.3005 290.2045 300.5813 308.7245 348.8468 396.7398 421.1065 442.3416 462.9901 474.6361 483.4732 484.8125 495.0199 518.2692 524.7398 575.9939 614.9346 619.9680 646.7187 689.3736 728.5073 752.1714 763.4039 774.2645 802.0754 838.8308 868.7830 888.1127 897.2941 933.6989 967.2957 974.1785 985.5307 999.5891 1000.3934 1015.9757 1018.3078 1034.1553 1067.6969 1096.7733 1112.5585 1145.9183 1152.6859 1165.8396 1168.2746 1224.6663 1242.0910 1249.5329 1271.8021 1308.5707 1349.4590 1370.1485 1406.3154 1423.5269 1439.9082 1461.0568 1505.2024 1553.5839 1593.0912 1625.6741 3022.2305 3091.0761 3124.6784 3133.9771 3140.1606 3157.9278 3167.8920 3173.0223
redmass: 6.9112 8.3698 17.7210 6.8405 11.9345 8.2767 12.5441 10.7532 4.5302 9.6567 14.9497 13.2956 14.7292 15.8118 6.9918 8.6464 3.2805 11.9854 3.5572 3.0688 9.0134 16.5534 5.0585 3.7720 18.0562 8.0425 6.8137 6.2066 5.5278 7.3124 9.0942 12.0804 3.6602 4.0444 4.7903 1.8406 2.6978 3.2400 1.5216 6.3572 1.8701 4.3056 3.7211 1.3578 3.4818 1.3904 9.3354 1.3459 2.6715 5.1255 7.1584 12.4036 10.9128 1.7860 1.8630 1.8203 7.5882 1.1374 1.9045 2.1893 1.8309 1.8537 2.5046 1.4669 2.8881 4.9985 2.2089 1.0870 3.1012 3.6188 7.2270 6.3968 6.6282 1.0590 1.1021 1.0874 1.0896 1.0894 1.0951 1.0971 1.0994
irintensity: 0.3024 0.0559 0.0558 0.6380 0.2013 0.2763 1.5257 0.6873 3.3480 3.6646 1.1934 1.0194 1.2594 0.1668 0.3689 1.2828 2.0656 0.4098 2.6059 6.4756 12.5000 5.2951 3.8704 8.2596 3.4181 1.9233 0.0641 4.0674 13.7313 4.3054 24.7779 13.9965 5.9790 3.4313 11.2805 42.6289 39.7082 0.9761 47.0399 41.7614 3.9049 62.5607 13.2707 2.1276 90.1822 4.5545 12.9014 0.0547 44.0387 82.6347 8.0772 247.3296 91.2956 11.8660 102.4135 96.3797 319.0804 4.2985 1.6689 5.6481 16.0339 3.0010 7.5237 4.6048 6.6325 7.6428 11.4398 25.2021 0.2536 38.3168 13.1412 25.1998 5.4207 3.2425 1.0694 2.6437 6.3413 11.7061 22.4698 10.0645 17.4132
temp: 298.150 k
press: 1.00000 atm
elementType: 17 9 9 9 9 9 9 7 6 6 6 6 6 6 6 6 6 6 6 6 6 1 1 1 1 1 1 1 1
symmnumber: 1
zpe: 486070.0 jmol-1
zpe.correction: 0.185134 hartree
zpe.thermalcorrener: 0.203509 hartree
zpe.thermalcorrenthalpy: 0.204453 hartree
zpe.thermalcorrgfe: 0.136845 hartree
zpe.sumelectzpe: -1612.535014 hartree
zpe.sumelectthermal: -1612.516639 hartree
zpe.sumelectthermalent: -1612.515695 hartree
zpe.sumelectthermalfe: -1612.583303 hartree
dipole: 4.1419 2.6488 -0.6101
dipole: 4.9542
quadrupole: -116.0802 -118.7742 -129.4788
quadrupole: -0.4378 3.7758 2.2284
quadrupole: 5.3642 2.6702 -8.0344 -0.4378 3.7758 2.2284
hfenergy: -1612.7201478 hartree
pointgroup: C01 [X(C13H8Cl1F6N1)]
dipole: 1.6604063 1.0202439 -0.0347082 debye
polarizability: 224.9280912|-26.0697518|148.0398838|8.1204096|29.3476703|108.1376114 unknown
InChI: InChI=1S/C13H8ClF6N/c14-11(12(15,16)17,13(18,19)20)7-9-6-5-8-3-1-2-4-10(8)21-9/h1-6H,7H2
charge 0 multiplicity 1
29 atoms
Cl -2.211615 1.499918 1.561334
F  -0.665773 -1.090524 1.524143
F  -1.618505 -2.073701 -0.282498
F  -2.86364 -1.598244 1.545633
F  -3.637419 -0.636409 -1.577674
F  -3.779811 1.580422 -1.132129
F  -4.605631 0.081771 0.337877
N  1.131863 -0.278586 -0.838635
C  -2.131438 0.284258 0.119655
C  -1.077957 0.737518 -0.927316
C  0.376903 0.778464 -0.477707
C  -1.820433 -1.11786 0.730998
C  -3.546985 0.319499 -0.541371
C  0.902789 1.910125 0.232785
C  2.473748 -0.284199 -0.483743
C  3.084899 0.807115 0.249318
C  2.24943 1.918122 0.594973
C  3.273248 -1.409944 -0.86013
C  4.475651 0.734276 0.582499
C  4.627565 -1.454662 -0.519891
C  5.232704 -0.377409 0.205353
H  -1.140601 0.032748 -1.776575
H  -1.393666 1.73452 -1.278456
H  0.245235 2.747105 0.483035
H  2.676846 2.768035 1.139409
H  2.786304 -2.22031 -1.410888
H  4.936938 1.560129 1.137349
H  5.235966 -2.319285 -0.806411
H  6.295889 -0.43169 0.463365
