program: Gaussian 09
title: 000293428
version: EM64L-G09RevD.01
frameworkgroup: C1[X(C8H10ClF5O2)]
method: RPBEPBE
basis: SDD
operation: Freq
keyword: #p
keyword: freq=noraman
keyword: PBEPBE/SDD
title: #p freq=noraman PBEPBE/SDD
converged: YES YES NO NO
title: Mulliken charges:
elementType: Cl F F F F F O O C C C C C C C C H H H H H H H H H H
charge: 0.083132 -0.119770 -0.106262 -0.131766 -0.149070 -0.130809 -0.428236 -0.175128 -0.157650 0.100429 -0.084198 -0.041183 0.369086 -0.710965 -0.709995 -0.116205 0.273133 0.236070 0.216367 0.213565 0.256566 0.217478 0.255905 0.223913 0.228713 0.386880
chargesum: 0.00000
title: Mulliken charges with hydrogens summed into heavy atoms:
elementType: Cl F F F F F O O C C C C C C C C
charge: 0.083132 -0.119770 -0.106262 -0.131766 -0.149070 -0.130809 -0.041356 -0.175128 0.115482 0.100429 0.151872 -0.041183 0.369086 -0.024467 -0.012699 0.112508
polarizability: 1.07822196e+02 1.35745661e+00 9.75386880e+01 -4.39563818e+00 5.41229933e+00 1.02300652e+02
1716.lowfreq: -16.9040 -9.5696 -0.0026 -0.0024 -0.0023 6.0151 39.6621 48.1158 64.1670
frequency: 39.5673 47.9986 64.0856 88.0785 107.1663 131.3351 160.2462 167.7897 205.2293 213.3866 223.1977 237.5383 257.2818 274.3565 282.0496 289.9894 294.0889 303.8880 314.1658 369.5223 383.8263 390.3055 413.1274 415.2248 443.1907 465.5394 503.9654 537.0473 565.8885 634.7773 748.4393 777.7052 833.5367 902.6232 906.3729 925.0445 926.4644 962.1986 966.3957 990.5454 1004.9739 1041.9240 1064.9480 1088.1483 1096.5295 1116.8376 1128.7653 1163.3610 1180.9423 1226.5455 1284.3668 1311.7802 1333.2505 1342.9551 1386.1899 1390.4560 1406.3907 1467.5159 1473.2765 1484.1939 1489.7419 1636.8539 2960.6655 2981.6072 2986.2031 3025.2603 3035.3081 3074.6646 3075.1829 3092.2640 3105.2560 3524.6506
redmass: 14.0359 5.1009 5.0023 5.0950 10.0484 7.5038 6.5477 7.7379 2.5840 1.6281 2.9206 1.3179 7.5973 5.9646 3.3266 7.1973 6.6324 4.1411 4.3543 11.6869 12.1037 2.7278 1.4444 5.0047 4.5319 11.6112 4.5433 4.7421 11.9986 14.3174 5.0185 3.9558 6.9698 3.9217 3.6780 1.6716 1.9456 1.6005 4.2990 2.8773 2.4294 5.6615 9.0957 5.1031 5.6573 3.6521 2.1653 3.7638 2.1718 1.3442 1.2748 1.4307 1.3956 1.2877 1.2089 1.1940 1.2013 1.0433 1.0515 1.0430 1.0524 7.7673 1.0879 1.0361 1.0379 1.0834 1.0840 1.0985 1.0994 1.0990 1.0994 1.0658
irintensity: 0.2011 0.8875 0.5510 0.3641 4.0515 1.3360 1.8563 3.6797 1.3640 3.4674 1.9919 0.1548 0.9798 4.9099 3.7900 4.9754 5.5362 8.5930 6.9357 5.1890 1.3422 15.7672 109.8186 17.2367 10.7772 11.1582 3.5128 24.1825 2.6657 26.9320 28.2466 30.2882 98.5263 60.9559 54.0978 19.4432 38.1451 8.2110 24.8887 148.7628 29.8662 124.0455 120.1519 192.6934 38.9792 115.6512 58.9722 11.5701 20.3053 11.7379 13.5564 48.2672 7.1271 3.5653 25.3300 6.3280 21.3038 3.4201 3.6841 17.1468 11.8124 122.9612 37.1902 23.3721 22.7120 2.7067 3.7315 28.0720 28.5219 28.8545 15.4857 42.4124
temp: 298.150 k
press: 1.00000 atm
elementType: 17 9 9 9 9 9 8 8 6 6 6 6 6 6 6 6 1 1 1 1 1 1 1 1 1 1
symmnumber: 1
zpe: 459032.2 jmol-1
zpe.correction: 0.174836 hartree
zpe.thermalcorrener: 0.192485 hartree
zpe.thermalcorrenthalpy: 0.193429 hartree
zpe.thermalcorrgfe: 0.129787 hartree
zpe.sumelectzpe: -1419.268548 hartree
zpe.sumelectthermal: -1419.250899 hartree
zpe.sumelectthermalent: -1419.249955 hartree
zpe.sumelectthermalfe: -1419.313598 hartree
dipole: -0.1292 -1.9794 1.5662
dipole: 2.5274
quadrupole: -106.1275 -107.5139 -96.8815
quadrupole: -7.7004 0.2809 5.8361
quadrupole: -2.6199 -4.0063 6.6262 -7.7004 0.2809 5.8361
hfenergy: -1419.4433843 hartree
pointgroup: C01 [X(C8H10Cl1F5O2)]
dipole: 0.0310439 -0.9157468 -0.3862372 debye
dipolederiv: -0.1491376 0.0276772 0.0441061 0.0179525 -0.1526003 0.152993 0.0577777 0.0897526 -0.6249712 -0.8782023 0.0582698 0.158705 0.1455782 -0.3424703 0.0277547 0.1230128 0.036956 -0.3405538 -0.4028383 -0.0517414 -0.1244537 -0.1873126 -0.5927315 -0.2273865 -0.1359434 -0.1447088 -0.459416 -0.3683982 -0.0561568 -0.186649 -0.074666 -0.3332383 -0.0485304 -0.1791527 0.0141585 -0.6878426 -0.760462 -0.0341327 0.2277392 -0.1319942 -0.336409 0.0093089 0.230973 -0.0464045 -0.4134713 -0.5015153 0.0582659 -0.0345278 0.1884672 -0.7180211 0.1060478 -0.0700049 0.0484186 -0.2502007 -0.2466478 -0.0367703 0.0678493 -0.0462577 -0.5668226 0.0405001 0.0736714 0.0219421 -0.7725106 -0.5436983 0.3049239 0.0210784 0.2787685 -0.6758855 0.0027372 0.104127 -0.0868061 -0.3954652 -0.0238481 -0.0163554 0.0187925 0.046279 -0.3911492 0.0887067 -0.121535 0.2107323 -0.1241523 0.1805629 -0.078269 0.0718119 -0.0403501 0.1967678 -0.1120861 -0.1157519 0.1056054 0.433098 0.1791062 0.2054272 -0.0236301 0.1536572 0.2022312 -0.0064852 0.024294 0.0203849 0.1297619 1.3045095 0.0219205 -0.1372471 0.0285375 1.0069351 0.1548992 0.0093309 -0.1048574 1.3985517 1.4677706 0.0167786 -0.0536363 0.008774 1.3291991 -0.0892741 0.0761217 0.00195 1.2330674 -0.0657252 -0.0088148 0.0551798 -0.0390856 0.0218113 -0.0124561 0.037749 -0.0275593 -0.0036468 -0.0130844 -0.0346213 0.00981 -0.0541908 0.0533121 -0.0501538 0.0005201 -0.0232261 -0.0973486 0.4840592 -0.461951 -0.0579206 -0.4337361 0.8768072 -0.0836398 -0.0208621 -0.2088198 0.6145337 0.0394272 0.0211418 -0.0322437 0.0054346 0.0724656 -0.0305034 -0.0567815 -0.0373988 -0.0357529 0.0207439 0.0254402 -0.0204166 0.0632156 -0.0812678 0.0496049 -0.0510617 0.0330263 0.005506 -0.0480484 -0.1162243 0.0155112 -0.1483375 -0.0459569 0.0044695 0.0030912 -0.0220934 0.0894213 0.0507698 0.0005276 -0.09862 0.0018347 0.0885913 -0.0325677 -0.0418454 -0.0226793 -0.1437855 0.0725359 0.0648351 -0.0103904 0.1141224 -0.0253923 0.0222405 -0.0345899 0.0624112 0.067698 -0.0129651 -0.1304333 -0.0324682 -0.1390824 -0.075466 -0.0194561 -0.0018933 0.0194724 0.0837851 0.0218969 0.0494525 0.1131721 0.0410137 0.0929309 -0.0121203 0.0969691 -0.0206287 -0.0069724 0.0211111 0.0839955 -0.0549525 0.1181267 -0.0595335 0.071636 -0.0311049 0.0251731 0.0517627 0.07213 0.0337564 0.0698236 0.0315679 0.0605736 0.0028084 0.0574291 0.0558662 -0.1345461 0.0999477 0.0530581 -0.0064231 0.0516832 0.395319 -0.0090474 -0.0345403 -0.0006676 0.3834501 unknown
polarizability: 108.220477|-2.9253793|95.4611125|-3.7478014|-3.4804445|103.9799456 unknown
InChI: InChI=1S/C8H10ClF5O2/c1-4(2)5(3-15)6(16,7(9,10)11)8(12,13)14/h3-5,16H,1-2H3
charge 0 multiplicity 1
26 atoms
Cl 0.791146 -1.712747 2.071292
F  2.418152 -1.514287 -0.026617
F  0.442508 -2.509962 -0.434187
F  1.852123 1.082712 1.430115
F  2.617496 1.064791 -0.711442
F  0.86709 2.365421 -0.147569
O  0.419852 -0.135447 -1.749412
O  -2.375239 2.273056 0.001122
C  -0.982445 0.271798 0.211257
C  0.454778 -0.060004 -0.30013
C  -2.042703 -0.904985 0.124759
C  1.025214 -1.425724 0.255269
C  1.44912 1.105511 0.086745
C  -3.214963 -0.607686 1.089853
C  -2.554038 -1.178044 -1.311903
C  -1.565356 1.485542 -0.537773
H  -0.900942 0.543945 1.28136
H  -1.54795 -1.822945 0.488523
H  -3.953189 -1.428589 1.037257
H  -2.867332 -0.528117 2.136683
H  -3.729593 0.334143 0.831969
H  -3.200186 -2.074291 -1.304617
H  -1.72485 -1.351462 -2.016644
H  -3.16397 -0.336972 -1.691158
H  -1.279417 1.580116 -1.608943
H  1.332494 -0.278173 -2.117509
