program: Gaussian 09
title: 000293403
version: EM64L-G09RevD.01
frameworkgroup: C1[X(C13H18F6O2)]
method: RPBEPBE
basis: SDD
operation: Freq
keyword: #p
keyword: freq=noraman
keyword: PBEPBE/SDD
title: #p freq=noraman PBEPBE/SDD
converged: NO YES NO NO
title: Mulliken charges:
elementType: F F F F F F O O C C C C C C C C C C C C C H H H H H H H H H H H H H H H H H H
charge: -0.125918 -0.130027 -0.153586 -0.133175 -0.141231 -0.136521 -0.435236 -0.175653 -0.261354 -0.104843 -0.113539 -0.445582 -0.483194 -0.022661 0.094507 -0.051354 -0.749746 0.357142 0.343734 -0.740981 -0.732411 0.295842 0.249415 0.271255 0.241807 0.208317 0.223220 0.234062 0.227530 0.248346 0.220674 0.225472 0.205631 0.224865 0.217628 0.196256 0.208696 0.256930 0.385683
chargesum: 0.00000
title: Mulliken charges with hydrogens summed into heavy atoms:
elementType: F F F F F F O O C C C C C C C C C C C C C
charge: -0.125918 -0.130027 -0.153586 -0.133175 -0.141231 -0.136521 -0.049554 -0.175653 0.034488 0.144572 0.157716 0.004542 -0.025912 -0.022661 0.094507 0.176176 -0.055254 0.357142 0.343734 -0.092857 -0.070528
polarizability: 1.57934841e+02 2.18500680e+00 1.43645681e+02 1.83567184e+00 7.56891450e-01 1.32914307e+02
1716.lowfreq: -10.9374 -0.0008 -0.0006 -0.0006 5.8201 10.6192 30.8496 48.2084 58.7896
frequency: 30.5971 48.1720 58.7720 64.9677 68.9914 108.5562 130.1014 140.2242 159.0095 167.1417 179.8062 186.3446 206.5549 208.2455 237.0182 244.1539 253.2902 266.9835 277.2248 280.7276 296.1342 301.5704 315.4484 320.3473 374.5261 385.1108 388.3098 407.5162 422.0382 433.3560 454.0977 457.7183 472.8863 492.0756 534.9533 561.9203 617.4988 637.4696 659.8092 703.2689 740.7150 771.5325 807.9348 830.6234 871.2464 885.7798 906.4571 918.8864 944.7234 950.8141 958.8648 976.7997 988.1929 988.8285 1012.9890 1020.8762 1031.1477 1057.1656 1074.4950 1083.7044 1093.1306 1098.5293 1129.0928 1137.7532 1145.3385 1149.2643 1169.4566 1179.3917 1186.8839 1207.4432 1256.6783 1276.8962 1278.3083 1297.3398 1305.1223 1313.1100 1330.5075 1345.0472 1353.9470 1358.7487 1364.5097 1380.1954 1396.5030 1403.7950 1462.1347 1464.3380 1471.2176 1478.2029 1479.4382 1481.3997 1488.9412 1496.8181 1618.0177 2968.6153 2973.8179 2981.7389 2985.1907 2987.7004 2995.9046 3002.1248 3020.9975 3037.9894 3051.2369 3058.2349 3064.8201 3066.9682 3075.0901 3078.3554 3086.9079 3096.8265 3515.6098
redmass: 7.2234 4.7127 16.4635 4.9803 3.3346 3.9465 10.5795 4.7135 4.0820 6.5601 6.6486 2.6741 1.1676 1.1729 2.6321 1.4351 8.0667 7.8068 3.2468 4.9205 15.2414 3.4047 3.7526 4.9175 3.1719 1.5771 2.0568 5.8853 3.1178 2.8577 3.7559 10.5397 7.2650 13.7184 5.3975 5.6154 12.4276 7.8704 7.7749 2.5889 3.7223 3.8608 3.1994 2.4199 3.8014 2.4135 4.0719 1.1729 1.7770 2.1860 1.5119 2.7062 4.1192 2.0190 2.0138 10.2941 3.3851 2.5325 4.3140 2.6974 2.4807 5.5846 3.6911 3.0186 1.8353 3.6890 3.3844 1.7976 1.6895 1.5101 1.3049 1.3639 1.3892 1.3578 1.3944 1.4783 1.3707 1.3285 1.5152 1.3285 1.4242 1.2122 1.2115 1.2003 1.0736 1.0557 1.0753 1.0489 1.0537 1.0518 1.0602 1.0489 8.9847 1.0372 1.0397 1.0665 1.0414 1.0719 1.0652 1.0794 1.0834 1.0848 1.0985 1.0983 1.1005 1.0977 1.0987 1.0994 1.0991 1.0981 1.0657
irintensity: 0.1449 0.1435 0.1014 0.1662 0.0145 1.4457 2.4333 0.4455 0.6853 2.2366 2.6572 0.9831 0.1327 0.4830 0.6893 0.9013 0.1461 2.7396 6.3518 10.5326 1.2043 6.2043 4.4817 3.3669 3.1711 82.2117 30.6100 11.2299 4.7091 3.0751 5.5942 4.5009 2.5303 1.1147 2.7954 1.3378 36.8094 24.6045 1.6544 6.6702 2.3615 16.1515 17.1885 17.3271 37.6577 3.3276 58.3264 3.0972 29.3152 12.4726 5.9151 30.5166 25.3639 9.6922 9.3179 9.5291 161.7373 81.9170 156.7374 49.4185 81.1646 310.8599 81.0452 83.1617 12.5304 30.7244 17.5993 11.2056 5.8412 4.1469 5.9353 6.4951 9.4712 20.2300 2.4124 22.9851 14.8997 1.4447 10.8883 6.0516 4.8781 20.8515 16.5557 19.9815 4.1423 8.4126 16.6947 5.6537 7.3863 2.4917 17.3213 19.1847 115.8343 26.6001 31.4934 10.0284 26.0736 8.2637 30.6245 20.4786 2.4301 12.3570 14.1445 3.3647 32.1117 97.5309 36.0750 25.5918 31.9877 25.5479 33.1456
temp: 298.150 k
press: 1.00000 atm
elementType: 9 9 9 9 9 9 8 8 6 6 6 6 6 6 6 6 6 6 6 6 6 1 1 1 1 1 1 1 1 1 1 1 1 1 1 1 1 1 1
symmnumber: 1
zpe: 777694.4 jmol-1
zpe.correction: 0.296208 hartree
zpe.thermalcorrener: 0.318358 hartree
zpe.thermalcorrenthalpy: 0.319302 hartree
zpe.thermalcorrgfe: 0.246210 hartree
zpe.sumelectzpe: -1254.015737 hartree
zpe.sumelectthermal: -1253.993587 hartree
zpe.sumelectthermalent: -1253.992642 hartree
zpe.sumelectthermalfe: -1254.065735 hartree
dipole: -1.0010 1.9636 -2.8864
dipole: 3.6317
quadrupole: -128.8889 -122.7268 -126.3499
quadrupole: -2.0696 2.6473 5.1727
quadrupole: -2.9003 3.2617 -0.3614 -2.0696 2.6473 5.1727
hfenergy: -1254.3119448 hartree
pointgroup: C01 [X(C13H18F6O2)]
dipole: 0.3901958 -0.8787663 -1.0569082 debye
polarizability: 158.0486596|1.7624485|143.3538875|-1.7633905|-1.6491593|133.0922821 unknown
InChI: InChI=1S/C13H18F6O2/c1-6(2)8-5-4-7(3)9(10(8)20)11(21,12(14,15)16)13(17,18)19/h6-9,21H,4-5H2,1-3H3
charge 0 multiplicity 1
39 atoms
F  -0.154301 2.324089 0.316096
F  -2.204114 1.861305 1.163511
F  -1.952352 2.437513 -1.028829
F  -3.081078 -0.885157 0.856024
F  -3.59341 0.349451 -0.974659
F  -2.590637 -1.647151 -1.222869
O  -0.608737 0.15186 -1.69043
O  1.524667 0.457676 1.968346
C  -0.270947 -0.535563 0.678428
C  -0.10385 -2.093253 0.475371
C  2.137897 -0.167508 -0.326627
C  0.879163 -2.400453 -0.685482
C  2.257752 -1.721355 -0.518205
C  -1.184746 0.188616 -0.362894
C  1.169199 0.033741 0.838202
C  3.497273 0.554107 -0.105037
C  0.34002 -2.732331 1.815121
C  -1.37799 1.699347 0.040525
C  -2.609451 -0.497706 -0.410321
C  4.54784 0.149505 -1.167124
C  3.306891 2.091754 -0.111178
H  -0.761722 -0.374366 1.658021
H  -1.083988 -2.534404 0.222729
H  1.653668 0.226682 -1.242598
H  0.428942 -2.07009 -1.638719
H  1.014226 -3.497597 -0.751434
H  2.807364 -2.148013 0.344392
H  2.869175 -1.917966 -1.416438
H  3.873402 0.262502 0.896344
H  1.28279 -2.305914 2.199971
H  0.487353 -3.819401 1.681655
H  -0.429498 -2.588012 2.595325
H  4.17069 0.334624 -2.192268
H  4.835723 -0.914392 -1.094678
H  5.467098 0.749771 -1.036979
H  2.929277 2.435863 -1.094132
H  4.269946 2.601323 0.076046
H  2.59692 2.415045 0.667799
H  -1.160252 0.681761 -2.326508
