program: Gaussian 09
title: 000293386
version: EM64L-G09RevD.01
frameworkgroup: C1[X(C15H14O2)]
method: RPBEPBE
basis: SDD
operation: Freq
keyword: #pfreq=noraman
keyword: PBEPBE/SDD
title: #p freq=noraman PBEPBE/SDD
converged: NO YES NO NO
title: Mulliken charges:
elementType: O O C C C C C C C C C C C C C C C H H H H H H H H H H H H H H
charge: -0.431257 -0.242298 0.090448 -0.466053 0.241460 -0.453578 -0.554061 0.330466 -0.229247 -0.179051 -0.347031 -0.571982 -0.351698 -0.360942 -0.382476 0.291597 0.159503 0.216804 0.243159 0.219922 0.224175 0.225680 0.226808 0.253239 0.247629 0.254843 0.227346 0.254168 0.252818 0.255571 0.354035
chargesum: 0.00000
title: Mulliken charges with hydrogens summed into heavy atoms:
elementType: O O C C C C C C C C C C C C C C C
charge: -0.077222 -0.242298 0.090448 -0.006090 0.241460 -0.009481 -0.101572 0.330466 0.023993 0.068579 -0.092188 -0.344636 -0.097530 -0.108124 -0.126905 0.291597 0.159503
polarizability: 2.30759531e+02 2.01989363e+01 1.60562193e+02 1.26221004e+00 -2.57015698e-01 1.06685471e+02
1716.lowfreq: -9.5625 -6.8107 -0.0009 -0.0007 -0.0005 6.4996 39.1543 50.8926 75.1159
frequency: 39.0497 50.7574 75.0875 164.4776 165.2855 187.5652 230.4948 255.7040 276.0462 309.3081 343.5537 361.4018 379.2016 415.5521 429.3115 447.8024 453.3704 471.9227 479.0793 539.5978 562.7978 583.0455 609.2715 642.9604 677.3194 715.1979 730.8974 762.2811 784.6277 826.8835 836.5935 840.7167 856.9351 876.5287 892.5916 922.5934 937.8743 960.8454 976.5023 994.3902 1003.5833 1010.7621 1026.0052 1082.4550 1090.2666 1113.3046 1133.7039 1146.5553 1165.9356 1179.9366 1185.3011 1205.3143 1237.0621 1255.9255 1264.0629 1287.9663 1292.3131 1334.3747 1337.0179 1350.9997 1368.4314 1377.9626 1386.5655 1424.2899 1452.1862 1464.5381 1476.2339 1497.9850 1557.7788 1598.1174 1600.8927 1615.9097 1650.9873 2958.3835 2979.9520 2993.3942 3025.5675 3050.2962 3058.4327 3097.9993 3102.9842 3110.4362 3132.9683 3149.8804 3153.9770 3175.3681 3580.5008
redmass: 8.0076 3.7951 3.8032 4.9205 4.0345 3.4252 3.3583 4.6415 6.0330 2.0977 4.1350 1.1217 4.5998 2.9040 3.2446 3.5840 3.3886 3.5252 2.8407 5.8343 2.9529 5.9043 3.2628 4.5094 2.7049 4.6976 3.5148 6.3726 1.3793 1.4223 1.8266 1.8937 1.9961 1.7983 2.9008 3.0447 2.8378 1.3907 2.5415 1.3203 1.3106 2.5952 3.0102 1.7861 2.1649 1.7481 1.6068 1.2054 1.6554 1.1245 1.4262 1.6576 1.7912 1.9992 1.4968 1.8415 1.5327 1.3906 1.6297 1.5070 1.5783 2.3795 6.1853 3.3236 1.1204 1.0916 1.0922 2.7075 8.5230 8.1844 6.9796 6.5561 6.9899 1.0649 1.0641 1.0621 1.0936 1.1000 1.1014 1.0909 1.0871 1.0869 1.0895 1.0964 1.0981 1.0953 1.0660
irintensity: 1.9914 0.0302 0.1799 3.2057 1.6551 0.1553 1.4501 0.2699 2.1108 1.1734 0.2740 137.1560 7.4103 3.0735 19.5543 11.0582 3.5360 4.3964 4.5457 8.8249 6.3893 2.4250 10.0934 3.1928 17.3505 4.7352 0.7255 2.7095 0.6110 6.3036 31.7718 30.2770 28.1086 34.6017 36.0806 1.3890 0.5332 0.0614 2.4567 1.4710 1.0333 14.1000 12.2991 13.9105 5.8968 4.3154 271.4467 14.1595 19.5740 7.4608 4.8648 1.3165 12.6284 34.0364 14.2147 3.3897 1.4572 1.5404 1.7909 0.2493 2.5801 19.0883 21.1716 38.7088 5.0071 16.0251 9.2301 62.8899 165.6851 5.1335 7.4215 77.7069 145.5441 28.8470 22.1116 26.8483 37.5842 44.6043 30.6467 23.3271 11.0779 6.7785 5.1916 22.7443 0.6471 5.2301 44.2593
temp: 298.150 k
press: 1.00000 atm
elementType: 8 8 6 6 6 6 6 6 6 6 6 6 6 6 6 6 6 1 1 1 1 1 1 1 1 1 1 1 1 1 1
symmnumber: 1
zpe: 650830.0 jmol-1
zpe.correction: 0.247888 hartree
zpe.thermalcorrener: 0.261903 hartree
zpe.thermalcorrenthalpy: 0.262847 hartree
zpe.thermalcorrgfe: 0.207066 hartree
zpe.sumelectzpe: -729.211880 hartree
zpe.sumelectthermal: -729.197865 hartree
zpe.sumelectthermalent: -729.196921 hartree
zpe.sumelectthermalfe: -729.252702 hartree
dipole: 5.3381 4.5423 0.5183
dipole: 7.0283
quadrupole: -114.0726 -99.7909 -96.0129
quadrupole: -1.6550 -3.2862 -1.6518
quadrupole: -10.7804 3.5012 7.2792 -1.6550 -3.2862 -1.6518
hfenergy: -729.459768 hartree
pointgroup: C01 [X(C15H14O2)]
dipole: -2.09096 -1.798374 0.1993896 debye
polarizability: 230.5478699|20.5675539|160.7752285|-1.1182894|0.3469436|106.6840971 unknown
InChI: InChI=1S/C15H14O2/c16-12-5-8-15(9-6-12)7-1-2-11-10-13(17)3-4-14(11)15/h3-6,8-10,17H,1-2,7H2
charge 0 multiplicity 1
31 atoms
O  -4.451313 1.769695 -0.164468
O  4.509678 1.48957 -0.299092
C  0.819379 -0.612333 0.197507
C  0.78906 -2.16141 0.494943
C  -0.626285 -0.043088 0.128025
C  -0.272552 -2.899939 -0.342709
C  -1.67995 -2.39638 0.031989
C  -1.775479 -0.874064 0.024056
C  1.584008 0.045905 1.331849
C  1.491829 -0.378266 -1.147229
C  -0.79705 1.36762 0.121729
C  -3.0566 -0.273344 -0.0737
C  2.766335 0.709442 1.178353
C  2.667864 0.295854 -1.305337
C  -2.065303 1.963486 0.02866
C  -3.203456 1.13017 -0.068763
C  3.399628 0.878789 -0.153505
H  0.561788 -2.308618 1.570203
H  1.798946 -2.57089 0.314779
H  -0.199128 -3.987848 -0.157019
H  -0.086605 -2.746782 -1.422907
H  -1.934033 -2.76805 1.046968
H  -2.439406 -2.821274 -0.651586
H  1.131191 -0.05652 2.327946
H  0.970258 -0.784885 -2.023497
H  0.088364 2.009916 0.191024
H  -3.942804 -0.918336 -0.157106
H  3.297251 1.148996 2.030634
H  3.122114 0.439125 -2.292617
H  -2.193289 3.04935 0.02483
H  -5.18414 1.108309 -0.230761
