program: Gaussian 09
title: 000293381
version: EM64L-G09RevD.01
frameworkgroup: C1[X(C16H17NO3)]
method: RPBEPBE
basis: SDD
operation: Freq
keyword: #p
keyword: freq=noraman
keyword: PBEPBE/SDD
title: #p freq=noraman PBEPBE/SDD
converged: YES YES NO NO
title: Mulliken charges:
elementType: O O O N C C C C C C C C C C C C C C C C H H H H H H H H H H H H H H H H H
charge: -0.271003 -0.267069 -0.436132 -0.297734 -0.361385 -0.494454 -0.578924 0.481891 0.504272 -0.491937 0.212539 0.162880 -0.450082 -0.327302 -0.394631 -0.382382 -0.202198 -0.385524 -0.348788 0.277680 0.222606 0.195782 0.222986 0.198487 0.228495 0.198167 0.251427 0.292926 0.236463 0.248502 0.234804 0.232488 0.234488 0.235050 0.216952 0.248637 0.352022
chargesum: 0.00000
title: Mulliken charges with hydrogens summed into heavy atoms:
elementType: O O O N C C C C C C C C C C C C C C C C
charge: -0.271003 -0.267069 -0.084110 -0.046307 0.057003 -0.072980 -0.152262 0.481891 0.504272 -0.199011 0.212539 0.162880 -0.213619 -0.078800 -0.159828 -0.149894 0.267340 -0.168572 -0.100151 0.277680
polarizability: 2.84186417e+02 1.56812052e+01 1.71213427e+02 -1.88354939e+01 1.20864667e+01 1.18400420e+02
1716.lowfreq: -59.4585 -14.7751 -3.2340 -0.0012 -0.0011 -0.0006 1.1904 6.3959 15.9032
frequency: -59.4525 -1.0624 15.5846 29.1357 34.5333 61.4789 104.5328 123.8345 149.5382 158.2349 216.7502 227.1850 273.9344 299.6020 318.2376 353.3853 366.0350 394.0654 402.3125 411.3994 420.8709 443.2337 502.5614 512.5063 550.6124 587.1837 608.1992 636.5869 677.0912 685.8593 715.9832 720.3420 752.7169 761.4499 776.4018 796.7569 808.2068 809.4448 825.5346 839.5830 842.8808 889.8446 915.9693 928.9990 932.3912 958.5965 969.9496 981.2422 1003.6502 1004.5295 1034.1242 1056.7066 1065.8908 1075.4630 1109.3369 1119.0625 1119.1948 1143.2411 1145.2270 1159.8695 1171.6273 1178.0564 1214.9281 1228.9789 1246.0219 1251.4019 1256.6885 1275.5159 1285.6734 1318.5538 1327.5110 1364.9266 1373.6404 1390.5305 1407.7722 1424.1867 1438.5830 1449.4746 1469.9215 1475.4728 1483.4101 1487.5886 1495.8562 1505.2777 1597.4761 1609.9490 1627.4325 1630.4274 2860.2868 2868.1325 2969.6024 2975.3991 3002.4008 3008.2703 3049.7692 3084.2143 3108.9225 3122.6338 3134.1799 3135.7054 3168.5366 3178.2436 3181.0561 3429.3097 3582.3178
redmass: 2.3521 4.7124 4.3892 6.0309 3.9550 6.7463 2.7993 2.3802 5.3254 4.9422 5.7687 4.3322 5.2274 2.8383 4.8423 1.1127 5.8344 4.5955 3.2132 2.9510 3.0478 4.4288 3.7658 4.6771 3.2974 4.8489 5.2625 6.7372 4.7325 1.6367 4.1325 3.6283 5.0336 3.9524 5.1550 1.1816 1.4188 1.3843 2.5168 2.1197 10.3013 1.4156 3.1567 1.3585 1.3892 1.3577 2.1718 3.6300 2.8545 2.0559 2.6629 3.6266 1.4587 2.2438 1.4076 1.0859 1.6684 1.5142 2.2925 1.1436 1.6532 1.1069 2.0558 1.3661 2.8741 4.6795 1.3134 1.1818 1.4060 1.2637 1.5154 1.2903 1.6055 5.9752 2.7880 2.8256 4.0481 1.2947 1.7841 1.2229 1.1851 1.2326 1.0909 2.7802 6.4304 7.9791 6.4922 8.3182 1.0708 1.0708 1.0867 1.0648 1.0851 1.0533 1.0998 1.1189 1.0876 1.0899 1.0898 1.0962 1.0952 1.0944 1.0939 1.0743 1.0660
irintensity: 15.1800 0.4290 0.6248 0.0158 0.7089 0.0308 2.5782 2.7846 0.8104 2.6837 0.1812 0.3307 0.3208 3.0618 0.7760 144.5427 2.1739 0.9489 12.6897 1.5463 8.3824 5.8627 19.9164 7.6815 26.8295 3.7508 7.3916 1.1321 19.8874 58.9570 2.8308 4.8026 7.7963 16.9015 24.8617 3.1524 23.5135 49.0527 13.4800 37.5360 31.1225 17.1025 8.3694 2.1574 0.4966 0.2611 63.5220 101.8011 4.0709 3.3201 0.8381 15.1104 4.2982 27.8075 53.8835 6.4028 51.4967 252.0692 7.5861 10.0051 18.2849 4.8416 2.0781 2.7463 32.1096 208.9946 3.5711 1.7515 4.3043 13.5556 35.6541 2.1029 4.1875 17.3060 9.3200 18.5573 76.7051 36.5243 150.7454 8.6017 7.9365 15.2869 7.4306 99.3145 9.3496 4.6986 29.1227 0.2296 49.3906 148.6899 27.6389 27.0158 33.9717 132.9576 25.9854 36.2305 20.1984 20.2359 11.0222 14.9185 6.8657 4.5714 4.0767 0.3729 38.8382
temp: 298.150 k
press: 1.00000 atm
elementType: 8 8 8 7 6 6 6 6 6 6 6 6 6 6 6 6 6 6 6 6 1 1 1 1 1 1 1 1 1 1 1 1 1 1 1 1 1
symmnumber: 1
zpe: 775616.4 jmol-1
zpe.correction: 0.295417 hartree
zpe.thermalcorrener: 0.312059 hartree
zpe.thermalcorrenthalpy: 0.313003 hartree
zpe.thermalcorrgfe: 0.248543 hartree
zpe.sumelectzpe: -898.827380 hartree
zpe.sumelectthermal: -898.810738 hartree
zpe.sumelectthermalent: -898.809794 hartree
zpe.sumelectthermalfe: -898.874254 hartree
dipole: 0.0491 -0.4330 -0.6574
dipole: 0.7887
quadrupole: -115.4551 -111.4365 -114.3870
quadrupole: -4.4172 -11.3224 4.8240
quadrupole: -1.6956 2.3231 -0.6274 -4.4172 -11.3224 4.8240
hfenergy: -899.1227967 hartree
pointgroup: C01 [X(C16H17N1O3)]
dipole: -0.0156323 0.2532272 -0.1786364 debye
polarizability: 284.4473258|6.0191873|172.1844065|23.215018|8.7058246|117.1685311 unknown
InChI: InChI=1S/C16H17NO3/c18-14-4-1-12(2-5-14)7-8-17-10-13-3-6-15-16(9-13)20-11-19-15/h1-6,9,17-18H,7-8,10-11H2
charge 0 multiplicity 1
37 atoms
O  4.901155 1.707477 0.831582
O  6.481041 -0.005942 0.238604
O  -7.815652 0.288052 -0.37736
N  0.081887 -0.369374 0.04455
C  -1.359825 -0.383314 -0.273221
C  0.962206 -0.883974 -1.027031
C  -2.182943 0.221109 0.892444
C  2.438185 -0.710082 -0.6847
C  -3.670778 0.269246 0.582228
C  2.873887 0.490008 -0.046667
C  4.238076 0.616126 0.210558
C  5.167156 -0.387785 -0.137776
C  3.374924 -1.717338 -1.022845
C  4.766294 -1.57195 -0.758204
C  -4.258213 1.422425 0.004881
C  -4.507147 -0.853714 0.821516
C  6.339985 1.335763 0.866325
C  -5.630887 1.461527 -0.32666
C  -5.87864 -0.835052 0.498388
C  -6.439817 0.326919 -0.078746
H  -1.519426 0.225577 -1.185199
H  -1.752053 -1.4064 -0.501633
H  0.720671 -0.307587 -1.944795
H  0.771927 -1.957003 -1.278444
H  -1.78821 1.233525 1.096265
H  -2.00426 -0.385487 1.803698
H  0.282489 -0.823728 0.946936
H  2.147076 1.257293 0.230194
H  3.02251 -2.637417 -1.502945
H  5.486708 -2.350919 -1.020007
H  -3.636645 2.306124 -0.184509
H  -4.079663 -1.756035 1.276242
H  6.671261 1.276271 1.917871
H  6.915674 2.070414 0.27674
H  -6.065461 2.368083 -0.768682
H  -6.524828 -1.697525 0.687006
H  -8.11236 1.144887 -0.772906
