program: Gaussian 09
title: 000022505
version: EM64L-G09RevD.01
frameworkgroup: C1[X(C4H12N4)]
method: RPBEPBE
basis: SDD
operation: Freq
keyword: #pfreq=noraman
keyword: PBEPBE/SDD
title: #p freq=noraman PBEPBE/SDD
converged: YES YES NO NO
title: Mulliken charges:
elementType: N N N N C C C C H H H H H H H H H H H H
charge: -0.078819 -0.078885 -0.066503 -0.066623 -0.599733 -0.619853 -0.619829 -0.599742 0.209982 0.217778 0.248718 0.210160 0.220514 0.257892 0.220547 0.257836 0.210109 0.217766 0.248700 0.209984
chargesum: 0.00000
title: Mulliken charges with hydrogens summed into heavy atoms:
elementType: N N N N C C C C
charge: -0.078819 -0.078885 -0.066503 -0.066623 0.076745 0.068713 0.068663 0.076708
polarizability: 1.25774533e+02 5.02042688e-01 7.10326802e+01 -4.21810053e-03 -1.13910444e-03 5.23611615e+01
1716.lowfreq: -6.9993 -3.0395 -0.0010 -0.0006 0.0004 9.5297 78.8966 118.2714 137.4925
frequency: 78.8947 118.2703 137.4908 155.4200 180.7458 187.6943 189.1084 210.6033 295.6196 327.4846 342.4336 409.4458 415.7698 559.4335 581.2421 802.0826 881.0255 1011.6343 1031.9533 1034.3121 1047.6233 1084.5130 1088.3683 1126.2766 1131.0445 1243.6140 1260.6014 1293.1694 1295.9332 1357.4313 1411.7016 1411.8255 1428.7085 1434.9993 1445.4753 1445.8914 1463.4827 1464.6101 1479.5860 1480.8501 1491.2120 1492.0459 2916.3813 2917.5631 2927.7842 2932.5442 3043.1948 3043.4998 3048.7109 3049.0705 3104.7935 3104.9561 3109.5729 3109.9006
redmass: 2.5564 2.3853 2.8177 1.7092 1.0558 1.2015 1.2529 1.3478 2.5685 5.9134 2.5624 5.0422 2.4125 3.6366 4.7073 4.8291 3.9522 2.5393 1.4230 1.4656 3.2430 1.2521 1.2444 1.3669 1.4008 2.9959 2.6016 3.8731 5.6432 5.8777 1.1371 1.1452 1.1479 1.1983 1.0554 1.0603 1.0631 1.0725 1.0588 1.0660 1.0617 1.0713 1.0513 1.0510 1.0495 1.0502 1.0808 1.0807 1.0802 1.0804 1.1015 1.1016 1.1001 1.1002
irintensity: 0.0883 12.5161 14.2756 13.1186 0.1132 9.0986 4.8463 1.5816 0.0142 8.4720 4.4439 3.8728 9.9474 5.9152 62.4085 2.1121 6.3303 267.2368 0.3523 22.4424 2.2892 5.0766 0.1215 32.2898 0.0874 14.5129 0.8704 58.7641 0.6202 0.0522 23.9390 0.1623 4.1057 10.8832 13.8522 9.1011 25.8364 19.0794 22.5560 3.8671 48.9198 0.6153 159.6278 44.2975 113.2819 109.5656 34.5941 29.4767 30.5823 58.9262 9.6587 16.2658 45.9456 1.1153
temp: 298.150 k
press: 1.00000 atm
elementType: 7 7 7 7 6 6 6 6 1 1 1 1 1 1 1 1 1 1 1 1
symmnumber: 1
zpe: 446432.0 jmol-1
zpe.correction: 0.170037 hartree
zpe.thermalcorrener: 0.180565 hartree
zpe.thermalcorrenthalpy: 0.181509 hartree
zpe.thermalcorrgfe: 0.134819 hartree
zpe.sumelectzpe: -377.863855 hartree
zpe.sumelectthermal: -377.853327 hartree
zpe.sumelectthermalent: -377.852383 hartree
zpe.sumelectthermalfe: -377.899072 hartree
dipole: -0.0014 0.0005 1.2294
dipole: 1.2294
quadrupole: -38.9869 -48.2945 -51.8689
quadrupole: 0.7498 0.0025 -0.0004
quadrupole: 7.3965 -1.9110 -5.4855 0.7498 0.0025 -0.0004
hfenergy: -378.0338917 hartree
pointgroup: C01 [X(C4H12N4)]
dipole: 0.0050334 0.0037645 -0.4836329 debye
dipolederiv: -1.2019192 -0.1559726 0.0082735 0.311478 -0.2959097 0.0039963 -0.5275083 -0.0366449 -0.3990037 -1.2108752 -0.15635 -0.0253377 0.3036043 -0.2964447 0.0029826 0.5169681 0.0352326 -0.389294 0.7667666 0.0468999 0.0677052 -0.6447987 -0.2354122 0.0131378 0.195213 0.049514 -0.0631144 0.7702666 0.0485321 -0.0518176 -0.6420497 -0.2343206 -0.0274894 -0.1890535 -0.0512082 -0.0688137 0.4938636 0.191291 -0.1071342 0.4099049 0.199172 -0.0840111 -0.0404948 -0.0694892 0.3762278 0.0711975 -0.029186 0.0381361 -0.1614984 0.2460671 0.0910561 0.1512959 0.0749127 0.2781508 0.0750755 -0.0270727 -0.0423537 -0.1570085 0.2485175 -0.0941355 -0.1573504 -0.0756184 0.2719564 0.4907725 0.1882124 0.1119667 0.4073938 0.1969621 0.0889848 0.0484575 0.0704651 0.3814759 -0.0323618 -0.0649861 0.0261031 -0.1106621 0.0365426 -0.0297817 0.2322347 0.0764978 -0.2459038 -0.1753061 -0.0158076 -0.0765554 0.0690638 0.0962966 0.0479327 -0.0855636 0.040951 0.0318969 0.1274656 0.0924213 0.0354819 0.0040217 -0.0965824 -0.0355842 0.0245086 -0.0450426 0.0836183 -0.1788207 0.0742788 -0.0529696 0.0243974 0.0878218 -0.0154207 -0.0413939 -0.0199241 0.1006993 0.0549385 -0.0303416 -0.0669645 0.1170762 -0.0369214 -0.0430095 0.0457 -0.1431724 -0.161081 0.0747285 -0.1081885 0.089052 -0.0187791 -0.000979 0.0548324 0.0527464 0.0690737 -0.0016931 0.054431 -0.0342322 0.0707227 0.1167295 -0.0397158 0.046956 -0.0397359 0.1442769 -0.1576104 0.0773091 -0.1054691 -0.0891159 -0.0169049 0.0007347 -0.0552518 -0.0514664 -0.0711356 -0.0064197 -0.1805544 0.0730943 0.0485433 0.0234264 0.0873248 0.0155936 0.036232 0.0210733 0.1029949 -0.1781827 -0.0159282 0.0722704 0.0689637 0.0975378 -0.045717 0.0824673 -0.0403831 0.0337637 0.1286161 0.0919528 -0.0333065 0.003583 -0.0978661 0.0331095 -0.0236132 0.0442353 0.0835447 -0.0274108 -0.0631481 -0.0226998 -0.1079414 0.0371747 0.0318191 -0.2296433 -0.0736138 -0.251395 unknown
polarizability: 125.7711676|-0.3143783|71.0288302|0.6735085|0.1362429|52.3683773 unknown
InChI: InChI=1S/C4H12N4/c1-7(2)5-6-8(3)4/h1-4H3
charge 0 multiplicity 1
20 atoms
N  1.760449 0.021612 0.242259
N  -1.756762 -0.026761 0.209688
N  0.44278 0.487029 0.13914
N  -0.43729 -0.490935 0.124116
C  2.731061 1.000366 -0.260994
C  2.051937 -1.410757 0.077497
C  -2.045036 1.408016 0.060387
C  -2.717685 -0.997649 -0.326432
H  2.851363 0.96357 -1.367303
H  3.714652 0.818525 0.206389
H  2.382585 2.007904 0.016321
H  3.127251 -1.568596 0.26606
H  1.797366 -1.783214 -0.939945
H  1.458904 -1.994848 0.800524
H  -1.770433 1.795517 -0.946126
H  -1.466417 1.981321 0.803469
H  -3.123915 1.563102 0.230069
H  -3.710109 -0.821903 0.124247
H  -2.374995 -2.009279 -0.056822
H  -2.816309 -0.944921 -1.434243
