program: Gaussian 09
title: 000293372
version: EM64L-G09RevD.01
frameworkgroup: C1[X(C18H25N3O2)]
method: RPBEPBE
basis: SDD
operation: Freq
keyword: #p
keyword: freq=noraman
keyword: PBEPBE/SDD
title: #p freq=noraman PBEPBE/SDD
converged: YES YES NO NO
title: Mulliken charges:
elementType: O O N N N C C C C C C C C C C C C C C C C C C H H H H H H H H H H H H H H H H H H H H H H H H H
charge: -0.365025 -0.306447 -0.402069 -0.428418 -0.501994 -0.055524 -0.054324 -0.516691 -0.442944 -0.490593 -0.437758 -0.447952 -0.424382 -0.456015 -0.426735 0.229078 0.252514 0.070800 0.315592 -0.317708 -0.339635 -0.290903 -0.222432 0.272148 0.270371 0.221263 0.234592 0.208803 0.252831 0.235381 0.211992 0.206733 0.243894 0.227156 0.214118 0.223271 0.219453 0.212796 0.223766 0.215845 0.222788 0.311150 0.305520 0.361641 0.191376 0.315720 0.227775 0.229182
chargesum: 0.00000
title: Mulliken charges with hydrogens summed into heavy atoms:
elementType: O O N N N C C C C C C C C C C C C C C C C C C
charge: -0.365025 -0.306447 -0.090918 -0.122898 -0.140354 0.216624 0.216047 -0.060836 0.018689 -0.043220 0.012869 -0.006678 0.018343 -0.019454 0.011898 0.229078 0.252514 0.070800 0.315592 -0.126333 -0.023915 -0.063128 0.006750
polarizability: 3.00213821e+02 8.49488728e+00 2.54743513e+02 1.91801161e+00 7.77075236e+00 1.43142070e+02
1716.lowfreq: -28.7260 -18.9396 -2.2653 -0.0008 -0.0005 0.0001 5.3996 6.4886 16.8385
frequency: -26.6719 -17.0192 15.8800 25.9653 39.1798 42.2850 48.4880 57.9888 70.6500 96.0402 107.2844 129.9058 156.3578 167.3805 217.4617 234.6245 251.1173 279.8340 307.3499 366.2637 379.7736 389.6295 397.9001 423.7122 445.5060 459.4348 500.1055 504.4059 533.1920 595.8900 620.4023 626.4684 659.3812 675.9824 677.0853 694.2706 714.4735 733.4435 747.6499 775.9776 786.4215 792.6664 801.5654 805.1730 819.7732 843.6607 875.8554 879.9260 881.2679 888.8117 891.5392 902.1641 904.0520 922.6433 933.1805 942.4911 944.8583 989.8421 1003.9227 1005.0553 1021.2281 1021.9328 1045.0352 1048.6109 1065.5932 1069.0832 1082.1663 1082.3241 1097.6432 1148.1703 1151.8240 1152.5222 1178.2632 1181.5889 1182.8378 1205.3385 1206.0481 1213.3076 1220.1039 1226.6773 1237.2215 1257.0575 1260.2707 1277.9920 1285.1240 1288.9606 1290.7627 1293.7480 1308.9590 1312.7001 1318.5324 1319.7597 1323.4911 1350.7566 1354.7221 1374.6672 1431.3008 1440.7254 1458.4444 1463.2816 1467.0677 1471.0237 1473.2239 1474.9812 1477.5444 1490.3834 1495.6414 1501.6818 1512.2619 1564.8332 1590.5088 1626.0666 1658.1355 2988.0894 2992.4003 2999.0810 3003.7760 3004.6257 3005.2364 3013.3751 3016.0580 3045.5626 3046.3488 3049.2749 3058.6452 3065.0387 3065.2264 3074.3000 3077.3382 3086.9932 3088.1941 3092.1564 3114.4931 3135.7498 3162.2205 3183.8644 3541.1770 3568.8455
redmass: 3.1526 2.1987 2.6528 1.9189 4.5743 3.7155 5.1048 3.7457 3.8743 3.4796 4.3323 3.2820 4.8587 4.2698 4.1077 3.7173 4.2481 5.1154 5.2044 3.5565 2.4988 2.9228 3.1207 2.9351 3.0719 1.5047 2.8509 1.6414 2.7281 5.7556 2.6145 2.9817 5.3768 2.9850 2.9537 2.5827 7.1589 3.1597 1.7624 2.5616 1.9357 1.8769 1.6307 1.9575 4.0223 4.8137 1.4685 3.0579 2.6729 2.6550 2.3518 2.0955 2.2289 1.1957 2.0160 1.5436 1.7447 2.1623 1.3052 1.9763 1.6767 1.6535 2.5431 2.7163 2.5071 2.1589 1.4393 1.4514 2.2148 1.7011 1.7702 1.8438 1.1441 1.3599 1.4224 1.3661 1.3774 1.5027 1.5799 1.7632 1.4640 1.4479 1.3767 1.4566 1.2543 1.3570 1.3648 1.4134 1.4389 1.4954 1.5989 1.5599 1.9083 1.4053 1.3903 4.1863 3.2727 2.4614 1.0862 1.0861 1.1890 1.2199 1.1143 1.0835 1.3255 1.2657 1.1544 1.6225 3.5435 5.3767 4.7995 6.7515 2.0363 1.0630 1.0618 1.0641 1.0647 1.0609 1.0614 1.0663 1.0661 1.0982 1.0992 1.0875 1.0878 1.1024 1.1033 1.1015 1.1012 1.0891 1.0986 1.1016 1.0870 1.0891 1.0976 1.0957 1.0778 1.0770
irintensity: 0.0616 0.2685 0.2073 0.0324 0.7062 2.0478 3.2842 0.3722 7.3776 0.0982 3.4138 4.0509 2.0615 0.9922 7.5997 2.4683 8.6396 8.3049 8.1468 3.8961 2.9572 11.4759 7.9024 6.1354 4.7733 49.8653 6.3553 37.9074 51.4457 1.7283 1.3255 2.2969 12.9155 4.4467 7.4969 21.7248 3.6270 17.4471 50.8063 22.4222 11.0421 6.2499 0.0764 1.1109 1.9542 2.7752 6.6637 2.6674 3.1033 1.2673 5.7996 4.0613 9.1834 96.8192 17.6117 6.6222 6.7652 7.2503 3.7673 2.8852 1.4513 2.3381 16.9462 9.3722 0.6247 4.6209 8.9153 5.8489 1.5355 5.3321 3.3847 4.6727 11.5788 1.3306 0.0705 7.4580 10.5619 3.6052 21.2764 254.0909 89.5766 16.0670 15.5611 54.6842 69.2209 27.1374 7.8830 68.0989 1.4261 20.9186 3.0943 16.2942 35.7023 5.5611 14.2112 184.4981 41.8744 142.3365 18.5223 19.2165 243.6362 169.2757 57.1579 4.9559 428.6289 115.7381 51.7228 200.2410 523.4166 2.1051 327.1923 177.6537 63.7428 23.7833 19.3117 33.7300 30.9572 47.4483 53.2357 30.7500 34.2108 17.9551 16.1700 15.6775 16.3992 5.2827 2.3616 47.1788 64.7377 474.1916 68.4789 32.3798 25.0028 15.3343 22.1703 17.8551 22.2577 20.6915
temp: 298.150 k
press: 1.00000 atm
elementType: 8 8 7 7 7 6 6 6 6 6 6 6 6 6 6 6 6 6 6 6 6 6 6 1 1 1 1 1 1 1 1 1 1 1 1 1 1 1 1 1 1 1 1 1 1 1 1 1
symmnumber: 1
zpe: 1067749.7 jmol-1
zpe.correction: 0.406684 hartree
zpe.thermalcorrener: 0.427209 hartree
zpe.thermalcorrenthalpy: 0.428153 hartree
zpe.thermalcorrgfe: 0.353967 hartree
zpe.sumelectzpe: -1013.945099 hartree
zpe.sumelectthermal: -1013.924574 hartree
zpe.sumelectthermalent: -1013.923630 hartree
zpe.sumelectthermalfe: -1013.997817 hartree
dipole: 4.0673 -2.7719 -0.3665
dipole: 4.9356
quadrupole: -113.3176 -134.1253 -140.5888
quadrupole: 10.9750 -1.2718 2.4913
quadrupole: 16.0263 -4.7814 -11.2449 10.9750 -1.2718 2.4913
hfenergy: -1014.3517833 hartree
pointgroup: C01 [X(C18H25N3O2)]
dipole: -1.0429481 -1.6088882 0.3073383 debye
polarizability: 293.9671398|8.7349569|255.4730741|-30.2801492|-2.7929677|148.6591894 unknown
InChI: InChI=1S/C18H25N3O2/c22-17(19-13-7-1-2-8-13)15-11-5-6-12-16(15)21-18(23)20-14-9-3-4-10-14/h5-6,11-14,19-21H,1-4,7-10H2
charge 0 multiplicity 1
48 atoms
O  -0.14583 -1.470486 0.360616
O  2.389436 2.785984 0.091639
N  -2.293506 -1.657148 1.171138
N  3.258685 0.62682 -0.053531
N  0.966982 0.881562 0.253981
C  -2.217068 -3.13512 1.228686
C  4.644147 1.092291 -0.260171
C  -3.371063 -3.690137 2.096591
C  -2.49398 -3.78277 -0.156109
C  5.64909 -0.012377 0.145102
C  4.979097 1.3162 -1.762191
C  -4.616292 -3.703998 1.155973
C  -4.044703 -3.761338 -0.304246
C  5.692193 -0.979495 -1.077278
C  5.315057 -0.100794 -2.322464
C  -1.249367 -0.888159 0.709256
C  2.209144 1.526792 0.094909
C  -1.427899 0.597718 0.654666
C  -0.290457 1.46709 0.452939
C  -2.715036 1.188916 0.797655
C  -0.484044 2.88129 0.46348
C  -2.898716 2.581638 0.791614
C  -1.767841 3.422386 0.63539
H  -1.214985 -3.402552 1.605976
H  4.760151 2.023048 0.320124
H  -3.109988 -4.721552 2.395459
H  -3.528489 -3.112486 3.02612
H  -2.116911 -4.823097 -0.134785
H  -1.965637 -3.254339 -0.966267
H  5.376169 -0.511707 1.092144
H  6.639767 0.45638 0.290536
H  5.861628 1.980833 -1.830766
H  4.148899 1.812738 -2.291394
H  -5.273721 -4.562575 1.378431
H  -5.230267 -2.794498 1.297784
H  -4.363666 -2.872858 -0.878346
H  -4.408938 -4.646899 -0.853772
H  4.964372 -1.804042 -0.950347
H  6.684533 -1.451744 -1.184514
H  6.140728 -0.055911 -3.054468
H  4.44342 -0.529749 -2.848836
H  -3.132389 -1.205483 1.534086
H  3.076346 -0.378457 -0.054218
H  0.903355 -0.162788 0.207402
H  -3.605075 0.553397 0.883291
H  0.392029 3.518469 0.327666
H  -3.90145 3.007687 0.897136
H  -1.892011 4.511217 0.634415
