program: Gaussian 09
title: 000293295
version: EM64L-G09RevD.01
frameworkgroup: C1[X(C11H10N2O3)]
method: RPBEPBE
basis: SDD
operation: Freq
keyword: #p
keyword: freq=noraman
keyword: PBEPBE/SDD
title: #p freq=noraman PBEPBE/SDD
converged: YES YES NO NO
title: Mulliken charges:
elementType: O O O N N C C C C C C C C C C C H H H H H H H H H H
charge: -0.200623 -0.208801 -0.267763 -0.433266 0.068532 0.409882 0.068550 -0.043173 -0.390002 -0.326455 -0.046754 -0.192099 -0.247035 0.196899 -0.255811 -0.664876 0.352199 0.241495 0.279858 0.236078 0.238246 0.235089 0.237871 0.224259 0.241500 0.246201
chargesum: 0.00000
title: Mulliken charges with hydrogens summed into heavy atoms:
elementType: O O O N N C C C C C C C C C C C
charge: -0.200623 -0.208801 -0.267763 -0.081067 0.068532 0.409882 0.068550 -0.043173 -0.148507 -0.046597 -0.046754 0.043979 -0.008789 0.196899 0.217148 0.047084
polarizability: 2.17037691e+02 7.70050025e+00 1.57787474e+02 -5.10966509e+00 2.53521196e-01 6.70885782e+01
1716.lowfreq: -5.7609 -0.0004 -0.0002 0.0002 3.7731 7.9851 36.3785 44.0619 82.6638
frequency: 36.3301 43.9888 82.6453 89.2213 113.7286 142.3560 180.0637 216.8068 248.3365 266.7416 295.1279 309.3684 385.3642 421.8425 433.7951 489.0733 516.4405 519.7625 566.3619 580.3869 617.6747 686.9861 713.5644 744.2924 749.9817 760.2321 782.5337 793.5031 801.1941 818.0750 870.3190 882.9530 941.2818 973.2511 991.7182 1004.7956 1016.1706 1034.3019 1095.6586 1106.7928 1151.7742 1162.7474 1170.2688 1206.0859 1251.7521 1265.4786 1276.4489 1301.5410 1357.7407 1394.3439 1398.5110 1417.0631 1456.6980 1464.6464 1468.1058 1484.0134 1489.3058 1544.7784 1580.0050 1593.6793 1600.0585 1623.5046 2997.1317 3035.8658 3092.7540 3102.1053 3129.4009 3132.4117 3146.0428 3158.9707 3173.4262 3473.4858
redmass: 4.2329 3.4643 6.1246 5.0862 3.2689 6.9711 6.3725 1.3104 5.5525 4.6750 3.3417 4.3137 7.1203 3.9929 3.6809 8.2345 6.6252 5.3058 5.6966 6.5199 7.5696 3.9360 5.4790 1.2081 3.9164 5.4261 1.9494 3.8742 2.5708 1.4201 4.5739 1.5268 6.9570 1.3688 3.3266 1.3386 3.8444 2.2628 2.1626 2.1818 2.1276 2.0603 1.1170 2.8155 2.1204 1.8472 1.1328 2.5700 1.4057 1.2314 9.3098 2.4091 1.1193 1.0445 2.8817 1.0550 3.1570 6.1786 8.2819 9.2216 6.7717 7.0879 1.0361 1.0607 1.0978 1.1019 1.1068 1.0873 1.0898 1.0944 1.1003 1.0778
irintensity: 3.2740 0.7622 0.6850 0.5623 4.2142 1.3189 0.9479 4.0525 0.2291 2.7525 1.4015 31.3093 4.0152 4.1685 5.5546 1.8231 4.9860 8.6201 1.3464 4.2572 2.2496 26.3108 0.8930 25.6812 10.4835 17.4931 112.1668 2.9484 25.0509 8.6497 4.9873 1.6672 27.1345 3.5888 73.7002 0.4426 14.5948 2.1542 27.9333 11.0209 47.9397 72.3552 22.0191 273.7490 78.0568 0.1922 8.8211 130.6079 17.3205 21.4123 9.1347 38.8224 19.6869 14.8206 80.8237 12.4575 113.2217 235.3661 132.5564 67.6445 113.6159 52.8613 16.0069 26.9904 30.1460 4.0741 22.8490 2.3688 9.3089 5.9140 22.2253 109.5378
temp: 298.150 k
press: 1.00000 atm
elementType: 8 8 8 7 7 6 6 6 6 6 6 6 6 6 6 6 1 1 1 1 1 1 1 1 1 1
symmnumber: 1
zpe: 510944.0 jmol-1
zpe.correction: 0.194608 hartree
zpe.thermalcorrener: 0.208420 hartree
zpe.thermalcorrenthalpy: 0.209364 hartree
zpe.thermalcorrgfe: 0.152847 hartree
zpe.sumelectzpe: -759.221480 hartree
zpe.sumelectthermal: -759.207669 hartree
zpe.sumelectthermalent: -759.206725 hartree
zpe.sumelectthermalfe: -759.263241 hartree
dipole: 0.5409 -5.7541 0.2103
dipole: 5.7833
quadrupole: -61.5144 -104.9442 -93.0680
quadrupole: 8.6187 -0.6441 0.0650
quadrupole: 24.9944 -18.4353 -6.5591 8.6187 -0.6441 0.0650
hfenergy: -759.4160885 hartree
pointgroup: C01 [X(C11H10N2O3)]
dipole: -0.1929027 2.2312218 -0.4018356 debye
dipolederiv: -1.6492947 -0.229946 0.1765265 -0.5349608 -0.5310798 0.0755634 0.1283928 0.028358 -0.3016183 -0.4851326 0.2175057 -0.0468221 0.0335669 -1.1021865 0.1689176 -0.0098395 0.1785818 -0.3903336 -0.8801734 0.1250199 -0.017718 -0.1184507 -0.8280535 0.1542104 0.028193 0.1230081 -0.3505361 -1.0389289 -0.1847919 0.0485077 -0.0039696 -0.6512837 0.1014473 -0.008316 0.1045889 -0.2213798 -0.6392013 0.5787221 -0.1242768 -0.0281534 -0.7474831 0.1149088 0.0018407 0.1274826 -0.2592539 0.7516362 -0.0742921 0.0212173 0.0175938 0.0873589 0.0016502 0.0044281 -0.0011514 0.0892056 -0.2904201 -0.2763206 0.0634402 -0.1006891 -0.389649 0.0898234 0.0203563 0.0875561 -0.019574 0.1795266 0.2037557 -0.0513466 0.4520556 0.9311111 -0.1852351 -0.104612 -0.1905536 0.1466619 -0.2656758 0.0458833 -0.0096356 -0.1022881 0.0919456 -0.06731 0.0227637 -0.0644026 -0.172 -0.0147709 0.146345 -0.0322476 -0.1551679 0.098895 -0.045881 0.0370614 -0.0434343 -0.0878591 0.9495531 -0.3501384 0.0781815 -0.0421301 1.3825329 -0.2630923 0.0194635 -0.2765374 0.2817035 0.0792641 -0.0534415 0.0155651 0.118829 0.2057214 -0.0755315 -0.0250158 -0.0769637 -0.1046838 0.074496 -0.1268416 0.0332024 -0.0764391 -0.2586754 0.0203089 0.0203262 0.0191008 -0.1738395 1.9343675 0.0502918 -0.0485787 0.5954082 1.1014473 -0.2742807 -0.115729 -0.1966606 0.265098 1.0413749 0.0459969 -0.1125129 -0.0901657 0.2491322 0.0248538 -0.0083445 0.0561302 0.327354 -0.1418678 -0.0004734 0.0541253 0.0546953 0.0159143 -0.0507986 0.0118939 -0.0817117 -0.0981898 0.3680998 -0.041469 0.0024788 -0.0646094 0.234953 0.0175221 0.0136687 0.0174438 0.3160165 0.0546119 0.0893455 -0.022726 0.0411696 -0.0428767 0.0510884 -0.0113232 0.0512757 0.1617315 0.107495 -0.0086118 0.0010183 0.0693501 0.0241427 0.0306736 -0.0165848 0.0299116 0.1469458 -0.0052487 -0.1001924 0.0218673 -0.1065332 -0.0060277 0.0365939 0.0227968 0.0363714 0.1474889 -0.1113796 0.0288943 -0.0095594 0.031211 0.0859638 0.0191212 -0.0105355 0.0190417 0.1619108 -0.0232573 -0.019804 0.0409587 0.0899889 0.027671 0.1041641 -0.0155751 0.0565348 -0.0458165 -0.0399495 -0.0411785 -0.0037994 -0.0707315 -0.0466248 -0.0893714 -0.0141378 -0.0557528 0.0634145 -0.178547 0.0407508 -0.001758 0.0613589 0.1182259 -0.0091884 0.0258462 0.0031933 0.0861461 0.1340805 0.040438 -0.0391382 0.0204646 -0.0051808 0.1094 -0.0044118 0.0718125 -0.0319215 0.0893418 -0.1054479 -0.0369697 -0.0914032 -0.0458943 -0.059558 -0.0126063 -0.0232232 0.063329 unknown
polarizability: 217.2512946|6.4481558|153.1031249|-4.5228447|-19.8817325|71.5593238 unknown
InChI: InChI=1S/C11H10N2O3/c1-2-16-11(15)9-12-8-6-4-3-5-7(8)10(14)13-9/h3-6,12H,2H2,1H3
charge 0 multiplicity 1
26 atoms
O  -3.17076 -0.414855 0.121277
O  1.204538 -2.72885 0.742286
O  -2.493869 1.774242 -0.333696
N  0.09284 1.102396 -0.164896
N  -0.509013 -1.17384 0.357094
C  1.470255 0.863657 -0.091825
C  1.888871 -0.465555 0.222585
C  -0.812519 0.076888 0.061489
C  2.420085 1.893221 -0.319265
C  3.276389 -0.743553 0.304438
C  0.876941 -1.542198 0.46089
C  3.789572 1.589882 -0.231546
C  4.222784 0.271594 0.080262
C  -2.242929 0.564581 -0.067065
C  -4.614683 -0.002628 0.036784
C  -5.096102 0.524384 1.390073
H  -0.298273 2.027256 -0.381471
H  2.086054 2.908912 -0.559677
H  3.573592 -1.769148 0.546243
H  4.529008 2.37893 -0.405735
H  5.293189 0.05162 0.144492
H  -4.715523 0.756414 -0.758593
H  -5.119398 -0.93679 -0.252427
H  -6.183274 0.719326 1.34161
H  -4.91359 -0.216815 2.18633
H  -4.589386 1.468127 1.652138
