program: Gaussian 09
title: 000293286
version: EM64L-G09RevD.01
frameworkgroup: C1[X(C9H8N2O5)]
method: RPBEPBE
basis: SDD
operation: Freq
keyword: #pfreq=noraman
keyword: PBEPBE/SDD
title: #p freq=noraman PBEPBE/SDD
converged: YES YES NO NO
title: Mulliken charges:
elementType: O O O O O N N C C C C C C C C C H H H H H H H H
charge: -0.410706 -0.168144 -0.248173 -0.241851 -0.214556 -0.448131 0.030052 0.359632 0.089136 0.291023 -0.325276 -0.390517 -0.218381 0.093379 0.221049 -0.785769 0.326543 0.274863 0.246949 0.363946 0.248942 0.267258 0.246473 0.392261
chargesum: 0.00000
title: Mulliken charges with hydrogens summed into heavy atoms:
elementType: O O O O O N N C C C C C C C C C
charge: -0.018445 -0.168144 -0.248173 -0.241851 -0.214556 -0.084185 0.030052 0.359632 0.089136 0.291023 0.001266 -0.115654 0.028568 0.093379 0.221049 -0.023097
polarizability: 2.03813818e+02 -1.61594507e+00 1.53574027e+02 -8.44225900e+00 -3.05222006e+00 6.62031020e+01
1716.lowfreq: -54.6929 -8.0685 -0.0006 -0.0005 -0.0003 0.9135 5.8435 40.7885 46.9066
frequency: -54.6878 40.7771 46.8947 79.5297 102.4378 126.4497 145.0786 165.6359 194.1359 249.9818 265.4897 294.2540 326.1892 358.7880 366.3298 413.2265 487.4724 520.4782 523.9236 566.4558 579.8593 610.0093 629.3190 659.4498 673.8203 712.8010 747.5066 761.8789 797.2641 826.2076 868.2236 873.8562 936.5513 963.4501 993.4841 1009.1794 1036.4107 1045.4903 1047.4537 1119.0239 1169.1859 1179.0601 1219.5426 1232.2613 1301.9386 1310.8372 1343.0649 1370.8848 1381.3491 1409.6896 1449.1265 1463.6144 1475.5687 1528.3442 1583.2501 1600.8370 1640.7196 1650.8507 2993.3634 3078.1581 3140.8605 3155.0936 3176.8591 3192.6556 3297.2180 3525.9806
redmass: 1.0451 9.4368 8.3026 4.6696 8.0976 6.5493 5.3634 5.9116 7.3362 6.8358 5.9216 6.7822 5.8693 6.3965 7.4751 7.8174 3.8554 2.7077 4.3835 3.1314 2.6851 2.3764 5.7964 5.3228 7.1009 6.6169 5.7452 4.2640 8.0448 1.5671 1.5501 2.2052 1.4132 4.4305 2.1450 1.3365 1.6858 2.8689 4.0147 2.0603 4.0052 1.5094 1.6889 2.4652 2.7527 3.0204 4.2109 5.3097 1.2550 4.3622 1.1026 1.0459 3.2982 2.1556 4.8911 6.6201 4.5071 9.7820 1.0383 1.0979 1.0988 1.0888 1.0953 1.0966 1.0792 1.0642
irintensity: 0.8725 0.4829 0.9418 10.0735 0.3006 1.9941 8.9963 1.4989 7.5338 0.4966 0.7301 1.7104 0.1197 2.2762 4.1742 3.0621 1.5668 21.6237 27.1289 27.8895 19.3841 96.6511 3.0444 10.8887 0.4742 40.2005 19.3893 11.1749 5.5525 66.7420 57.3343 33.4562 0.8676 19.1873 105.0669 4.1821 8.3159 160.4550 25.2312 8.9204 287.6884 12.2553 39.0967 86.9124 62.7377 115.5393 535.6675 23.8055 65.4119 3.0447 45.8172 20.5777 204.1500 247.9064 111.0187 166.8906 82.1133 233.7099 2.5003 9.1027 8.1281 6.5866 3.3253 13.7509 102.0674 49.6710
temp: 298.150 k
press: 1.00000 atm
elementType: 8 8 8 8 8 7 7 6 6 6 6 6 6 6 6 6 1 1 1 1 1 1 1 1
symmnumber: 1
zpe: 436846.8 jmol-1
zpe.correction: 0.166386 hartree
zpe.thermalcorrener: 0.180254 hartree
zpe.thermalcorrenthalpy: 0.181198 hartree
zpe.thermalcorrgfe: 0.124783 hartree
zpe.sumelectzpe: -832.164203 hartree
zpe.sumelectthermal: -832.150335 hartree
zpe.sumelectthermalent: -832.149390 hartree
zpe.sumelectthermalfe: -832.205805 hartree
dipole: -1.3910 0.7811 1.8638
dipole: 2.4533
quadrupole: -92.9949 -90.5222 -94.1354
quadrupole: 9.4390 7.1015 -0.9826
quadrupole: -0.4441 2.0287 -1.5846 9.4390 7.1015 -0.9826
hfenergy: -832.3305889 hartree
pointgroup: C01 [X(C9H8N2O5)]
dipole: 0.5651521 -0.3177594 0.7150005 debye
dipolederiv: -0.4281046 0.0828949 0.1999866 0.0685437 -0.6058161 -0.3922614 0.3530838 -0.3518141 -0.9041165 -0.8375956 0.2243209 -0.1983035 0.221346 -0.5631207 0.0983874 -0.3171727 0.1130284 -0.2982498 -0.515898 -0.3049945 -0.1638668 -0.1416153 -0.7243408 -0.0764895 -0.1676585 -0.046164 -0.3242654 -0.9570373 0.004175 0.0054012 0.5502327 -0.7436152 -0.0648453 0.1059812 -0.0642452 -0.3347928 -1.0079911 -0.118059 -0.2723525 -0.0174246 -0.4050086 -0.1891488 -0.043322 -0.1751727 -0.5986851 -2.3250075 -0.1313974 -0.0326421 -0.3340855 -0.4286692 0.0040588 0.0506725 0.000018 -0.290024 0.9862993 -0.0524738 0.4356782 -0.4143975 1.623218 -0.0420034 0.4736612 -0.0814026 0.4010475 1.0046659 0.0392096 0.0530063 1.0437031 0.3535408 0.0167645 0.1654179 -0.0749581 0.1430978 -0.1532885 0.0006934 -0.0947842 0.4532835 -0.7646607 0.0065394 0.052924 -0.0159772 -0.0208403 -0.3491872 0.3354577 0.0136108 -0.0692733 0.2718009 -0.0482907 -0.1123689 0.0734881 -0.0105766 -0.2375853 -0.064269 0.0087426 -0.6006632 -0.2191305 -0.005056 -0.0716284 0.0106017 -0.1497587 -0.2532133 0.2330549 -0.0072118 0.2530477 -0.277802 0.0179634 -0.0392081 0.0408743 -0.131718 0.3998476 -0.1911081 0.0076895 0.0404019 0.2537622 0.0238116 0.0108828 0.0341925 -0.0960346 1.6243834 -0.1005978 0.0880225 -0.1864244 0.696899 0.6290104 -0.1552459 0.4916789 1.1382189 2.4420407 0.1185 -0.0111296 -0.4632275 0.9527803 0.1218996 -0.1555643 0.1300084 0.2000577 -0.2224939 -0.164304 -0.018955 -0.33473 -0.2951087 -0.0400259 -0.0376393 -0.0450162 0.0312526 0.144254 0.0662339 -0.0047579 0.0133565 0.1338564 0.0002984 -0.0027999 -0.0132593 0.1799368 0.0175593 -0.0681052 0.0017672 -0.040763 0.0738299 0.0017643 0.028398 -0.0237635 0.1582925 0.0899689 0.0199239 0.0035162 0.0179167 -0.0672776 -0.0126831 0.0084943 -0.0163208 0.1517132 0.3403964 -0.0013024 0.0330814 -0.1572116 0.2203144 -0.0336664 -0.0073419 -0.0096215 0.2968213 0.0686551 0.0339715 -0.0683647 0.0016729 0.0296893 0.0798068 -0.0360351 0.0952233 0.0139135 -0.0666782 0.012847 0.0073191 0.0773883 0.0833094 -0.0095423 0.0172908 -0.0081561 0.1315735 0.0748715 0.0048507 0.0690434 -0.010632 0.0713119 -0.0620471 0.0290151 -0.0792049 -0.039463 0.1611383 0.020478 -0.0544969 0.029555 0.3302376 -0.0242447 -0.1498367 0.0159626 0.3525993 unknown
polarizability: 203.9974718|0.0571138|153.0536601|7.1297455|7.2350435|66.5398157 unknown
InChI: InChI=1S/C9H8N2O5/c1-5(12)10-7-4-2-3-6(9(13)14)8(7)11(15)16/h2-4,10,13H,1H3
charge 0 multiplicity 1
24 atoms
O  -3.119135 0.664815 1.212702
O  -1.72478 2.014847 -0.747115
O  0.291675 2.436169 0.213568
O  3.802889 -1.060982 -0.194119
O  -3.961085 -0.56394 -0.576722
N  2.015254 0.45305 0.086109
N  -0.642264 1.607072 -0.184946
C  0.897254 -0.390074 0.008967
C  -0.431752 0.162925 -0.025152
C  -1.579911 -0.680113 -0.038654
C  1.025758 -1.810859 -0.065487
C  -1.415089 -2.073361 -0.117118
C  -0.111457 -2.626858 -0.144892
C  -2.989797 -0.178289 0.106245
C  3.380266 0.114643 -0.013795
C  4.301641 1.320339 0.122601
H  2.031994 -2.232628 -0.074543
H  -2.301822 -2.71282 -0.138999
H  0.014077 -3.712331 -0.208926
H  1.770313 1.446354 0.246848
H  4.098739 2.066208 -0.6676
H  5.344058 0.982562 0.038501
H  4.162121 1.818777 1.09948
H  -4.053647 1.002291 1.268245
