program: Gaussian 09
title: 000293285
version: EM64L-G09RevD.01
frameworkgroup: C1[X(C16H13NO4)]
method: RPBEPBE
basis: SDD
operation: Freq
keyword: #p
keyword: freq=noraman
keyword: PBEPBE/SDD
title: #p freq=noraman PBEPBE/SDD
converged: YES YES NO NO
title: Mulliken charges:
elementType: O O O O N C C C C C C C C C C C C C C C C H H H H H H H H H H H H H
charge: -0.257245 -0.227953 -0.206710 -0.198497 0.026382 0.578737 0.224466 -0.538494 0.262112 -0.414963 -0.371375 -0.346711 0.492950 -0.294600 0.139980 -0.385386 -0.397936 -0.234616 -0.236031 -0.236731 -0.498335 0.258888 0.244026 0.282094 0.226261 0.220442 0.224391 0.232227 0.230540 0.232951 0.234966 0.243370 0.254716 0.236083
chargesum: 0.00000
title: Mulliken charges with hydrogens summed into heavy atoms:
elementType: O O O O N C C C C C C C C C C C C C C C C
charge: -0.257245 -0.227953 -0.206710 -0.198497 0.026382 0.578737 0.224466 -0.279606 0.262112 -0.170937 -0.089281 -0.120450 0.492950 -0.074157 0.139980 -0.160995 -0.165709 -0.004076 -0.003080 -0.001765 0.235835
polarizability: 4.77898947e+02 -3.30666985e+01 2.09405801e+02 -1.81885583e+00 -1.57647313e+01 9.12639216e+01
1716.lowfreq: -3.6298 -0.0003 0.0001 0.0004 1.3490 5.1594 20.2314 26.5623 39.9294
frequency: 20.2235 26.5528 39.9279 48.3622 66.4119 80.6956 85.3526 90.7893 124.2679 145.0704 155.8190 197.1396 233.8773 239.8495 266.5753 293.0051 318.8656 325.9896 365.5962 401.4713 407.6429 439.0727 463.7610 499.0250 558.7406 570.3219 600.9225 615.3208 649.4571 666.7610 670.9590 693.6998 706.8150 751.6736 759.3199 772.3158 780.6941 840.0908 842.5261 848.4519 876.8163 895.8910 918.4359 931.4622 963.5404 977.9199 980.9897 987.7137 990.0193 1002.1678 1026.2239 1045.0923 1086.1704 1108.9659 1117.3520 1151.7439 1155.5909 1175.0840 1184.4755 1193.0666 1219.6739 1229.5649 1243.6413 1275.0319 1305.7561 1326.0787 1343.5891 1362.5628 1388.4034 1401.0894 1417.5861 1427.7398 1441.8636 1452.4739 1463.8471 1467.6384 1488.2381 1574.4570 1581.4943 1597.4434 1612.8003 1630.9415 1642.2743 3007.6689 3095.7720 3108.7943 3112.9991 3121.7226 3129.2334 3140.7547 3141.9872 3152.5521 3154.6372 3161.0937 3168.5153 3181.3392
redmass: 4.1182 5.0078 7.0989 4.6633 1.3139 4.3243 6.1659 3.2140 5.1208 4.3971 5.1852 8.3413 6.8133 3.0468 3.7753 5.0513 5.3573 5.3504 7.7265 2.7655 8.0204 3.3411 4.6201 3.2220 5.3892 6.6366 7.0076 6.4393 7.2200 4.2531 6.8073 1.7780 6.3113 3.7758 5.4215 1.9364 9.0856 4.4773 1.4599 1.3299 4.7148 1.6725 1.6555 1.6973 4.5502 1.2893 1.3697 5.8054 1.2972 1.3008 2.1983 5.6547 1.6367 1.8335 1.5180 1.5520 1.8927 1.0666 3.1387 1.1351 4.5807 2.8564 1.6483 1.2935 1.8508 1.8541 1.3469 9.2850 6.9419 5.2205 1.6362 2.2120 2.2746 1.0519 1.0524 2.6349 2.4473 7.3396 5.5805 5.7368 6.0403 10.6097 5.2509 1.0292 1.0916 1.0867 1.1050 1.0877 1.0859 1.0904 1.0910 1.0962 1.1049 1.0911 1.1015 1.0949
irintensity: 0.1582 1.4842 1.1660 0.0059 1.2359 2.9872 1.3639 2.9743 0.9698 0.2581 1.5180 1.0047 1.5087 3.8236 8.7040 4.8900 0.1296 3.8483 8.6259 0.0245 5.9046 1.5653 0.4308 7.4223 17.3283 7.8853 3.4685 0.1480 4.1949 11.6415 6.7486 65.4002 3.8576 5.0316 15.2972 35.8836 23.1820 7.9123 14.5225 15.1723 7.5458 5.1503 7.3235 1.8085 28.4121 20.8086 9.6286 2.3875 25.3402 10.5600 4.4353 99.3842 6.0910 38.0427 12.4819 10.1456 62.2778 1.5124 94.5818 37.1128 471.9240 401.6516 50.4163 14.3196 18.0600 14.1561 25.2298 141.3384 21.8425 8.1394 26.6481 29.8968 17.1135 13.1677 11.1407 9.4718 4.7165 47.8880 39.4895 222.5253 37.8970 149.3941 69.5718 34.9677 1.7808 32.3338 15.7248 9.2670 1.4953 10.6953 1.8661 35.9661 13.3910 1.3021 41.4814 1.1530
temp: 298.150 k
press: 1.00000 atm
elementType: 8 8 8 8 7 6 6 6 6 6 6 6 6 6 6 6 6 6 6 6 6 1 1 1 1 1 1 1 1 1 1 1 1 1
symmnumber: 1
zpe: 663947.7 jmol-1
zpe.correction: 0.252884 hartree
zpe.thermalcorrener: 0.271908 hartree
zpe.thermalcorrenthalpy: 0.272852 hartree
zpe.thermalcorrgfe: 0.202351 hartree
zpe.sumelectzpe: -971.578859 hartree
zpe.sumelectthermal: -971.559836 hartree
zpe.sumelectthermalent: -971.558891 hartree
zpe.sumelectthermalfe: -971.629393 hartree
dipole: -6.2770 0.1085 1.8695
dipole: 6.5504
quadrupole: -118.7919 -108.5632 -129.4861
quadrupole: 11.9746 6.3002 4.7783
quadrupole: 0.1551 10.3839 -10.5390 11.9746 6.3002 4.7783
hfenergy: -971.8317437 hartree
pointgroup: C01 [X(C16H13N1O4)]
dipole: -2.4897568 -0.0283156 -0.6647702 debye
polarizability: 479.7330445|21.1792583|201.9220849|-12.60772|-29.4464881|96.9135394 unknown
InChI: InChI=1S/C16H13NO4/c1-21-16(18)14-11-13(9-10-15(14)17(19)20)8-7-12-5-3-2-4-6-12/h2-11H,1H3
charge 0 multiplicity 1
34 atoms
O  3.65113 -1.865962 -0.81094
O  2.462429 -2.478855 1.104015
O  4.807797 1.968624 -0.65107
O  4.791551 0.15063 0.731658
N  4.201086 1.005219 -0.038354
C  -0.103621 0.87408 -0.204427
C  2.053414 -0.318207 0.036962
C  0.647132 -0.31451 0.041236
C  2.735695 0.908631 -0.185812
C  0.622026 2.073374 -0.471972
C  2.025357 2.096705 -0.458382
C  -1.569139 0.918764 -0.202885
C  -3.884423 -0.093435 0.077099
C  -2.415771 -0.126477 0.071041
C  2.743826 -1.643148 0.21603
C  -4.646659 1.074278 -0.226887
C  -4.590061 -1.289045 0.402605
C  -6.053581 1.041489 -0.204379
C  -5.999236 -1.321851 0.425464
C  -6.738693 -0.155571 0.121646
C  4.476205 -3.092485 -0.690949
H  0.139037 -1.265268 0.227856
H  0.070952 2.999138 -0.672313
H  2.586183 3.018579 -0.633354
H  -1.999795 1.90044 -0.442451
H  -1.980288 -1.104947 0.319662
H  -4.139478 2.011043 -0.482238
H  -4.020918 -2.196561 0.63996
H  -6.622535 1.947562 -0.440494
H  -6.519822 -2.251599 0.678995
H  -7.833768 -0.17609 0.137947
H  3.834737 -3.974322 -0.527686
H  5.174496 -2.977286 0.154694
H  5.018333 -3.159735 -1.643874
