program: Gaussian 09
title: 000293283
version: EM64L-G09RevD.01
frameworkgroup: C1[X(C16H17NO4)]
method: RPBEPBE
basis: SDD
operation: Freq
keyword: #p
keyword: freq=noraman
keyword: PBEPBE/SDD
title: #p freq=noraman PBEPBE/SDD
converged: YES YES NO NO
title: Mulliken charges:
elementType: O O O O N C C C C C C C C C C C C C C C C H H H H H H H H H H H H H H H H H
charge: -0.284442 -0.288249 -0.440296 -0.319009 -0.684572 -0.450705 -0.287055 -0.291319 0.390686 -0.492902 0.121716 -0.317416 0.334989 -0.405040 0.378394 -0.349502 -0.383548 0.137204 -0.222106 -0.197449 -0.258107 0.216654 0.214364 0.229997 0.211156 0.214875 0.236193 0.289669 0.250702 0.219051 0.249192 0.245397 0.372271 0.300997 0.222607 0.225729 0.226983 0.382894
chargesum: 0.00000
title: Mulliken charges with hydrogens summed into heavy atoms:
elementType: O O O O N C C C C C C C C C C C C C C C C
charge: -0.284442 -0.288249 -0.057401 -0.319009 -0.011304 -0.019688 0.154097 0.159748 0.390686 -0.203233 0.121716 -0.066714 0.334989 -0.185989 0.378394 -0.100310 -0.138152 0.137204 0.000500 0.028280 -0.031124
polarizability: 2.29046516e+02 -9.62509332e+00 1.81712974e+02 3.45077710e+00 2.42020472e+01 1.87626713e+02
1716.lowfreq: -3.4322 -0.0008 -0.0005 -0.0003 4.7434 7.2890 13.1692 20.9904 34.9157
frequency: 13.0787 20.9453 34.8301 45.5597 79.1193 94.2563 97.5495 135.7163 149.1165 173.5969 199.5740 215.6435 228.9779 236.8813 329.8448 340.0039 354.6960 383.5649 407.6718 411.0393 412.4782 418.1080 436.3144 453.3378 503.5112 507.0985 536.1458 572.4892 580.1890 593.3465 609.7804 623.1327 687.7948 692.1580 700.2844 707.4485 745.9871 758.7033 765.4906 780.7772 809.5763 821.9084 836.2750 882.7272 889.0761 909.8700 911.1165 933.4463 951.8126 961.0498 975.9784 981.6002 983.3464 1005.8038 1022.1796 1047.4162 1051.1340 1082.5467 1092.2188 1123.2911 1129.8887 1166.7811 1177.2229 1179.3767 1200.8680 1203.8143 1212.5805 1221.9606 1279.0660 1287.8576 1314.8933 1322.2200 1344.8075 1356.2056 1373.6901 1375.2696 1391.0209 1401.4607 1431.1717 1437.0085 1443.6135 1471.1144 1478.7722 1487.2925 1498.1762 1553.2514 1580.5458 1591.6149 1612.0700 1627.8934 1654.7958 2959.3811 2969.7940 3008.6691 3027.0035 3039.6915 3073.4720 3127.0231 3127.5809 3135.4998 3154.1884 3162.5611 3163.0036 3171.6930 3185.9395 3423.0277 3533.9293 3654.7155
redmass: 6.7218 5.4219 3.8598 6.6276 6.9351 7.7686 5.3419 4.3847 3.3053 5.4363 3.4467 3.0030 4.6092 4.4920 2.8903 4.5459 4.9825 4.5217 3.8079 5.8881 2.9760 2.2176 1.4007 3.5469 2.9011 3.5989 2.2693 4.9971 1.3415 4.7670 6.3780 4.6564 4.6047 2.0478 1.1435 4.8646 3.3032 1.6648 3.7807 4.8360 1.6416 1.2966 2.3663 3.5133 1.5021 2.7978 1.5046 1.3963 2.5609 1.3786 3.4241 1.3084 5.8637 3.5842 2.0581 1.7599 1.8940 1.5497 1.8292 2.1606 1.6878 1.0800 1.1862 1.1673 1.1341 1.1956 2.4100 3.2120 1.6356 1.1518 1.3350 2.9360 2.7385 1.3510 1.6907 1.8551 3.8380 3.4970 5.3035 1.1015 2.3418 1.5438 1.1450 1.4328 2.4065 3.0530 5.5844 6.4142 6.2035 1.6851 7.0688 1.0566 1.0568 1.0669 1.1032 1.1037 1.1017 1.0846 1.0887 1.0890 1.0925 1.0954 1.0945 1.1007 1.0918 1.0548 1.0640 1.0956
irintensity: 0.0040 0.5199 0.5904 0.6542 0.9647 2.5824 1.6189 2.6918 1.2257 2.1190 6.1020 4.7057 0.7792 3.4785 1.8585 7.7781 12.4248 4.1712 1.4273 0.9862 0.0340 77.1485 58.8548 4.2100 13.2009 7.8671 0.8306 5.4853 165.8886 3.6116 0.3560 40.0678 1.6559 34.9317 128.3708 18.8104 17.4023 86.4397 33.0826 9.8516 48.5642 1.1565 8.2996 2.4665 10.4244 2.4678 16.3306 1.2813 85.6410 0.9513 114.4943 0.4359 4.8513 207.2366 14.7653 64.8355 28.2421 20.2576 3.7279 26.8916 175.1433 10.4715 45.6846 40.5203 15.5285 58.0293 234.2272 155.4001 57.2336 5.7120 1.1619 41.2742 110.4271 10.0523 3.0409 2.8096 13.6404 2.6894 10.3214 15.6714 2.9102 158.3106 70.6300 13.2664 78.4329 447.0148 225.4383 22.2856 75.7444 52.2665 83.0053 43.8334 30.3734 10.0784 38.9533 56.7498 28.5110 3.1193 18.4148 12.0662 32.5868 22.0355 13.9103 5.5255 3.8307 114.7188 52.9212 48.8529
temp: 298.150 k
press: 1.00000 atm
elementType: 8 8 8 8 7 6 6 6 6 6 6 6 6 6 6 6 6 6 6 6 6 1 1 1 1 1 1 1 1 1 1 1 1 1 1 1 1 1
symmnumber: 1
zpe: 789727.3 jmol-1
zpe.correction: 0.300791 hartree
zpe.thermalcorrener: 0.320067 hartree
zpe.thermalcorrenthalpy: 0.321012 hartree
zpe.thermalcorrgfe: 0.250317 hartree
zpe.sumelectzpe: -974.025811 hartree
zpe.sumelectthermal: -974.006535 hartree
zpe.sumelectthermalent: -974.005591 hartree
zpe.sumelectthermalfe: -974.076285 hartree
dipole: -0.3382 1.7190 0.5198
dipole: 1.8274
quadrupole: -126.3110 -114.3230 -108.0291
quadrupole: 5.0705 7.9480 7.4036
quadrupole: -10.0899 1.8980 8.1919 5.0705 7.9480 7.4036
hfenergy: -974.3266023 hartree
pointgroup: C01 [X(C16H17N1O4)]
dipole: 0.1613228 0.5947335 -0.370391 debye
polarizability: 229.2374006|-2.0453902|170.61332|-7.1967299|-20.9677361|198.5354824 unknown
InChI: InChI=1S/C16H17NO4/c17-15-8-7-13(11-14(15)16(18)19)21-10-4-9-20-12-5-2-1-3-6-12/h1-3,5-8,11,18H,4,9-10,17H2
charge 0 multiplicity 1
38 atoms
O  -0.214414 1.558991 0.785369
O  3.114703 0.682206 -0.582675
O  -3.883156 -0.892862 2.965078
O  -5.71742 -0.919352 1.555852
N  -5.490022 0.297686 -0.83594
C  2.014984 2.452568 0.625161
C  0.674081 2.329438 -0.10258
C  2.733849 1.110418 0.777936
C  -1.515271 1.273993 0.321764
C  -2.338328 0.545027 1.192863
C  -3.670868 0.204276 0.832042
C  -2.024948 1.678073 -0.944851
C  -4.199032 0.609202 -0.450595
C  -3.337596 1.349366 -1.315709
C  3.781024 -0.54624 -0.724488
C  4.114255 -1.404686 0.353314
C  4.125005 -0.900879 -2.053497
C  -4.515065 -0.557637 1.75771
C  4.793349 -2.616959 0.086666
C  4.800858 -2.111368 -2.301485
C  5.140658 -2.978586 -1.233141
H  1.841495 2.882705 1.629314
H  2.665746 3.149418 0.064446
H  0.805274 1.79809 -1.066165
H  0.236685 3.331498 -0.291407
H  3.644731 1.218916 1.400731
H  2.061105 0.359573 1.236342
H  -1.951806 0.233169 2.165961
H  -1.405185 2.245679 -1.645428
H  -3.715918 1.66659 -2.294716
H  3.852944 -1.146987 1.383832
H  3.855711 -0.218591 -2.865981
H  -6.07432 -0.237041 -0.183989
H  -5.838563 0.586495 -1.74579
H  5.048891 -3.279658 0.921435
H  5.06368 -2.379684 -3.330977
H  5.666027 -3.919062 -1.429358
H  -4.531137 -1.404489 3.519261
