program: Gaussian 09
title: 000293281
version: EM64L-G09RevD.01
frameworkgroup: C1[X(C14H14N2O3)]
method: RPBEPBE
basis: SDD
operation: Freq
keyword: #p
keyword: freq=noraman
keyword: PBEPBE/SDD
title: #p freq=noraman PBEPBE/SDD
converged: YES YES NO NO
title: Mulliken charges:
elementType: O O O N N C C C C C C C C C C C C C C H H H H H H H H H H H H H H
charge: -0.318399 -0.208228 -0.210419 -0.425821 0.019255 -0.536318 0.453950 0.303904 -0.509798 -0.380828 0.180142 0.385348 -0.331824 -0.194700 -0.371638 -0.325876 -0.247657 -0.266000 -0.529592 0.243368 0.235233 0.327654 0.286722 0.280288 0.243475 0.239238 0.287257 0.236088 0.222468 0.223811 0.223817 0.225072 0.240012
chargesum: 0.00000
title: Mulliken charges with hydrogens summed into heavy atoms:
elementType: O O O N N C C C C C C C C C C C C C C
charge: -0.318399 -0.208228 -0.210419 -0.098167 0.019255 -0.057717 0.453950 0.303904 -0.223077 -0.100541 0.180142 0.385348 -0.088349 0.044538 -0.084382 -0.089787 -0.025189 -0.042190 0.159309
polarizability: 2.76160870e+02 -6.04145711e+00 1.47668476e+02 1.46357620e+01 5.71092956e+00 1.42764629e+02
1716.lowfreq: -5.6174 -3.3496 -0.0005 0.0003 0.0006 6.2743 13.3948 27.5902 34.1927
frequency: 13.0697 27.5210 34.1079 58.3417 93.0686 127.3947 140.3161 145.7171 178.3688 199.6184 221.6170 255.8535 263.2744 295.1993 314.3654 380.3405 420.1428 427.0219 450.5565 474.9309 479.9083 495.3781 523.5742 554.5471 562.3648 574.4776 635.0172 667.4845 671.3204 701.2999 719.8718 733.2125 738.6890 752.0379 798.1675 816.0464 828.3547 864.9698 898.3311 906.9927 955.4539 958.3343 989.0323 993.7400 999.3068 1010.3766 1046.0643 1079.9466 1084.0222 1090.6683 1116.0839 1132.8137 1152.7752 1172.3462 1173.3737 1191.6585 1200.7593 1221.8635 1251.1829 1277.1280 1283.8690 1322.4658 1333.5077 1369.5817 1399.4408 1405.0902 1429.4527 1433.1341 1445.4133 1459.0056 1463.7240 1464.9995 1477.5831 1480.3366 1521.3910 1588.6304 1598.3480 1616.1626 1620.1385 2943.9073 2961.8080 3024.2413 3049.7396 3122.7374 3132.3235 3145.0037 3146.5186 3154.1822 3156.3833 3165.8648 3171.1415 3187.8539 3572.5738
redmass: 6.1835 4.5681 5.8868 9.5728 3.3880 5.9164 4.5852 5.1664 4.2189 3.3553 1.6141 2.0396 3.2159 4.7456 3.7384 7.0236 3.0477 5.6675 2.8802 4.7669 2.4852 1.4934 5.6586 4.3504 3.8838 6.3611 5.4063 5.9663 4.3675 2.9056 4.2225 4.0681 1.2864 7.5861 4.2237 1.5566 1.4264 5.4420 1.3745 1.4059 1.2896 1.3798 6.1081 6.6184 1.7038 1.6871 2.0267 2.0895 1.8254 2.3205 1.2594 1.9867 1.4445 1.1272 1.0660 2.7122 3.2858 7.1177 1.2612 1.3355 1.6132 1.7430 1.4682 10.7233 3.4738 4.5221 1.5369 2.8402 1.4623 1.4696 1.5032 1.0584 1.8206 1.3125 3.0797 6.5679 5.6297 6.6903 6.6472 1.0664 1.0326 1.0938 1.1040 1.0998 1.0847 1.0889 1.0877 1.0917 1.0939 1.0942 1.1002 1.0964 1.0771
irintensity: 1.2975 0.4627 0.3790 0.2633 5.4472 6.0482 2.1716 0.8407 0.2458 4.5041 2.1544 0.8695 1.3115 1.4911 0.7493 3.0581 2.5662 0.5119 15.2291 1.0404 24.6781 99.1720 3.5095 8.5627 2.0205 1.7336 5.4244 3.2889 6.0688 34.9520 0.1410 20.0638 105.2996 12.8368 9.1668 40.4954 0.5929 3.7071 5.1556 5.0681 0.2774 10.4925 0.0228 51.3019 6.3641 9.3907 11.4308 8.6081 39.8481 19.1334 0.1130 47.1603 6.4207 37.2870 3.5188 20.4685 287.3989 205.2304 27.9129 5.4683 28.8142 57.6990 13.8655 114.5261 39.7993 9.2265 11.0170 22.8589 26.3773 31.6422 24.4795 12.7919 32.0730 11.9757 212.2565 27.8712 14.3547 41.2738 83.7720 39.8912 75.6176 12.1804 45.6721 22.8619 3.2283 12.6002 5.2342 1.1561 33.8467 6.7397 14.6878 3.0945 61.8833
temp: 298.150 k
press: 1.00000 atm
elementType: 8 8 8 7 7 6 6 6 6 6 6 6 6 6 6 6 6 6 6 1 1 1 1 1 1 1 1 1 1 1 1 1 1
symmnumber: 1
zpe: 671023.4 jmol-1
zpe.correction: 0.255579 hartree
zpe.thermalcorrener: 0.272662 hartree
zpe.thermalcorrenthalpy: 0.273606 hartree
zpe.thermalcorrgfe: 0.208162 hartree
zpe.sumelectzpe: -875.602231 hartree
zpe.sumelectthermal: -875.585148 hartree
zpe.sumelectthermalent: -875.584204 hartree
zpe.sumelectthermalfe: -875.649648 hartree
dipole: 6.6393 -2.3648 1.4530
dipole: 7.1961
quadrupole: -129.4415 -104.7154 -108.6038
quadrupole: -3.9078 -2.2404 1.1965
quadrupole: -15.1880 9.5382 5.6498 -3.9078 -2.2404 1.1965
hfenergy: -875.8578102 hartree
pointgroup: C01 [X(C14H14N2O3)]
dipole: 2.1265668 -1.6693775 0.840478 debye
polarizability: 256.6352743|-42.8960791|165.6311304|24.3735848|-3.543283|144.3275699 unknown
InChI: InChI=1S/C14H14N2O3/c1-19-14-8-3-2-7-13(14)15-10-11-5-4-6-12(9-11)16(17)18/h2-9,15H,10H2,1H3
charge 0 multiplicity 1
33 atoms
O  2.945296 -2.389644 0.366469
O  -5.452927 2.642204 0.048047
O  -4.808749 1.845034 -1.988466
N  0.781042 -1.193042 -0.573016
N  -4.641204 1.988942 -0.71517
C  -0.438377 -0.741668 -1.223101
C  -1.405147 0.058515 -0.33439
C  1.896397 -0.377817 -0.352921
C  -2.543653 0.6609 -0.915818
C  -1.192876 0.191829 1.05937
C  3.086135 -0.997686 0.153863
C  -3.44457 1.367494 -0.092898
C  1.922059 1.018095 -0.601298
C  -2.106084 0.910132 1.866888
C  -3.248859 1.507327 1.298886
C  4.25239 -0.251328 0.394321
C  3.098233 1.768708 -0.361582
C  4.260464 1.144025 0.133573
C  4.114575 -3.118423 0.855588
H  -0.973963 -1.634281 -1.598847
H  -0.196614 -0.130606 -2.119392
H  0.916672 -2.186463 -0.387468
H  -2.747471 0.593061 -1.989753
H  -0.304035 -0.270049 1.500552
H  1.023784 1.52275 -0.970769
H  -1.922185 1.005996 2.941891
H  -3.973389 2.068628 1.894082
H  5.155412 -0.736366 0.778114
H  3.095802 2.845821 -0.56048
H  5.168694 1.725778 0.320738
H  4.431009 -2.744998 1.848855
H  4.959552 -3.040796 0.144259
H  3.793093 -4.167272 0.938468
