program: Gaussian 09
title: 000293335
version: EM64L-G09RevD.01
frameworkgroup: C1[X(C19H22N6O4)]
method: RPBEPBE
basis: SDD
operation: Freq
keyword: #p
keyword: freq=noraman
keyword: PBEPBE/SDD
title: #p freq=noraman PBEPBE/SDD
converged: YES YES NO NO
title: Mulliken charges:
elementType: O O O O N N N N N N C C C C C C C C C C C C C C C C C C C H H H H H H H H H H H H H H H H H H H H H H
charge: -0.439279 -0.439204 -0.251164 -0.252454 -0.062716 -0.064548 -0.017560 0.000932 -0.169129 -0.178141 -0.366112 -0.345711 -0.372456 -0.602971 -0.594509 0.122116 0.119312 0.185913 0.179934 -0.363017 -0.357768 -0.316528 -0.315010 -0.207943 -0.207094 -0.245158 -0.243714 0.107334 0.109707 0.195849 0.257435 0.265469 0.228187 0.220254 0.267472 0.222035 0.239306 0.259461 0.261125 0.236544 0.223494 0.243745 0.251540 0.268155 0.269134 0.230019 0.232744 0.231986 0.232844 0.374737 0.375403
chargesum: 0.00000
title: Mulliken charges with hydrogens summed into heavy atoms:
elementType: O O O O N N N N N N C C C C C C C C C C C C C C C C C C C
charge: -0.064541 -0.063800 -0.251164 -0.252454 -0.062716 -0.064548 -0.017560 0.000932 -0.169129 -0.178141 0.087171 0.147945 0.115270 0.117831 0.126654 0.122116 0.119312 0.185913 0.179934 -0.119272 -0.106228 -0.048373 -0.045876 0.022076 0.025649 -0.013172 -0.010870 0.107334 0.109707
polarizability: 3.80356185e+02 -4.64179641e+00 3.06475389e+02 -4.39961367e+01 1.92023333e+01 2.17904035e+02
1716.lowfreq: -3.6338 -0.0008 -0.0003 0.0007 0.9811 5.0207 9.1323 14.6904 16.0514
frequency: 8.8502 14.6590 16.0261 26.6229 33.6995 48.6959 58.1940 63.2376 68.1106 70.7925 92.6420 94.1441 114.8610 118.9795 131.2690 133.5020 146.3847 176.1217 194.1146 219.5098 225.1979 229.0162 245.8287 283.7516 290.7285 301.3300 330.7107 338.1561 356.7426 384.0085 388.9246 402.9975 411.7277 442.9560 453.0181 457.0020 468.1715 477.5931 527.2641 550.7765 552.3820 565.4581 582.3703 585.8695 586.2188 598.9726 600.8088 639.1174 641.6161 687.3242 687.8001 725.2134 727.3089 739.2105 766.7852 768.3931 776.4922 777.9995 805.1327 816.7789 857.1726 874.8121 882.2441 888.3884 916.6698 965.6027 966.8288 985.2709 986.4940 990.6289 992.2212 1006.5772 1030.9653 1033.8234 1041.1512 1046.5829 1052.0099 1069.5136 1110.2272 1110.6140 1114.8531 1116.0745 1136.7585 1152.6999 1153.3596 1172.0238 1172.5437 1184.9306 1210.9564 1224.0374 1258.7827 1262.3313 1268.4776 1277.7392 1292.5107 1297.1690 1298.0010 1308.7976 1334.6049 1347.4639 1354.7484 1362.6475 1371.9384 1378.3075 1388.4749 1390.7334 1421.8276 1426.5627 1427.5054 1427.7512 1442.0353 1446.3835 1462.6009 1464.1738 1465.1042 1466.0760 1470.3019 1486.8376 1487.5230 1561.7332 1561.9965 1602.9275 1603.3895 1634.8609 1636.0831 2972.0854 2972.3220 2984.1325 2997.4049 3017.7653 3047.5935 3047.8479 3053.6713 3073.8935 3090.4131 3124.3912 3125.0264 3133.3855 3135.1368 3150.8788 3151.6460 3164.5808 3165.2602 3177.4988 3178.1518 3520.3873 3520.6499
redmass: 6.2856 6.0871 6.4351 5.6698 5.5010 8.2269 5.9987 3.9271 4.2959 4.4443 3.6964 4.4264 3.0540 1.4269 3.6506 4.5552 1.2618 2.3293 3.6123 3.8041 5.9150 4.9081 3.6804 4.0682 4.4313 5.1207 5.8042 5.5177 4.8883 3.6290 3.7146 4.2341 4.0043 5.3437 4.0137 3.7817 4.9220 4.7081 3.8862 3.5150 3.6494 4.3842 3.7506 1.4591 1.4426 3.4862 3.8934 5.3627 5.5560 3.9703 4.0821 3.4285 5.0847 2.1451 2.6279 2.2084 1.7387 1.7512 2.4505 3.0351 3.4131 3.1887 1.4745 1.7858 4.2440 1.4187 1.4174 4.5419 4.5204 1.3743 1.3559 2.2745 2.2578 2.3604 2.0225 1.9386 2.5113 2.8465 1.9487 1.8893 1.3172 1.2965 1.5936 1.6693 1.6835 1.1197 1.1090 2.3301 2.4371 1.7581 2.3498 1.7826 1.7470 2.6688 1.7281 2.4345 2.4433 1.4714 2.2854 4.5185 1.9635 1.6121 2.0634 1.9985 5.4828 5.0737 1.1333 1.2610 2.0181 2.2507 1.2948 1.1861 1.0785 2.0792 2.0986 1.2359 1.0906 1.1236 1.1121 6.4960 6.5219 6.4405 6.4575 8.3888 8.3981 1.0359 1.0363 1.0630 1.0616 1.0588 1.1013 1.1015 1.0970 1.1018 1.1053 1.0978 1.0977 1.0858 1.0859 1.0902 1.0904 1.0956 1.0957 1.0985 1.0985 1.0639 1.0639
irintensity: 0.0141 0.0377 0.0966 0.1482 0.3455 1.1549 2.8061 0.2348 2.6576 5.9642 1.7938 0.3906 0.3288 0.2234 1.8616 2.6131 0.7803 3.8254 4.1571 0.6156 0.0098 3.6948 1.3863 2.3372 2.6973 2.5077 8.8040 2.9472 5.2785 1.3520 4.5045 1.7396 0.5521 1.3666 1.6337 8.8678 4.0850 30.1703 20.0503 2.3974 8.6714 16.8459 31.1167 112.5048 28.7765 38.6007 29.8686 2.8700 7.6447 25.7178 86.6212 1.1482 10.5770 2.4238 79.9977 25.5992 42.2412 36.2212 22.9251 2.2001 19.6263 7.6111 0.7768 1.1871 1.5050 29.8479 24.5310 458.0247 110.8036 8.9662 6.4511 0.7419 157.9128 54.6530 9.1514 53.7347 100.8513 30.5525 53.2135 20.1915 9.3157 1.8108 30.4682 103.3442 129.7835 1.9720 1.2566 10.8877 8.7232 15.7826 36.8886 11.5377 0.6297 23.1056 7.9082 127.7682 25.7316 21.2873 170.4122 227.8903 91.9684 20.8695 74.5565 50.1006 101.2678 91.7822 44.7894 31.0027 38.0382 21.1188 75.9191 45.8898 4.0427 99.8616 23.0703 53.2718 26.7534 17.7412 36.9435 48.1362 10.7235 9.9156 13.9558 125.3374 341.4189 62.6403 79.9569 35.6806 51.7863 36.8164 31.1799 23.5076 10.1250 5.8730 13.4888 9.1257 8.0472 4.2992 2.9471 13.8342 12.6504 15.6530 13.2678 18.9034 16.6997 37.4249 28.9388
temp: 298.150 k
press: 1.00000 atm
elementType: 8 8 8 8 7 7 7 7 7 7 6 6 6 6 6 6 6 6 6 6 6 6 6 6 6 6 6 6 6 1 1 1 1 1 1 1 1 1 1 1 1 1 1 1 1 1 1 1 1 1 1
symmnumber: 1
zpe: 1034567.2 jmol-1
zpe.correction: 0.394046 hartree
zpe.thermalcorrener: 0.422645 hartree
zpe.thermalcorrenthalpy: 0.423589 hartree
zpe.thermalcorrgfe: 0.329435 hartree
zpe.sumelectzpe: -1364.409242 hartree
zpe.sumelectthermal: -1364.380643 hartree
zpe.sumelectthermalent: -1364.379699 hartree
zpe.sumelectthermalfe: -1364.473854 hartree
dipole: -0.4698 -2.6706 2.3361
dipole: 3.5791
quadrupole: -163.0652 -146.0072 -159.8070
quadrupole: 5.1158 -5.2757 -0.3564
quadrupole: -6.7720 10.2859 -3.5138 5.1158 -5.2757 -0.3564
hfenergy: -1364.8032881 hartree
pointgroup: C01 [X(C19H22N6O4)]
dipole: 0.1468075 -1.0742519 -0.8984934 debye
polarizability: 380.9864361|0.9385678|305.5381702|-44.0556368|-19.0813036|218.2110032 unknown
InChI: InChI=1S/C19H22N6O4/c1-24(22-20-16-10-5-3-8-14(16)18(26)27)12-7-13-25(2)23-21-17-11-6-4-9-15(17)19(28)29/h3-6,8-11,26,28H,7,12-13H2,1-2H3
charge 0 multiplicity 1
51 atoms
O  -5.709705 2.177925 -1.699904
O  6.928577 -0.645019 0.338611
O  -3.44516 2.070627 -1.233037
O  5.065757 -1.523108 1.394342
N  -1.736685 -0.918628 -1.76369
N  2.261435 -2.427607 -0.452033
N  -2.953883 -0.698273 -1.214783
N  3.057074 -1.331974 -0.551663
N  -2.954305 -0.68217 0.106601
N  2.587798 -0.257172 0.050118
C  -0.274635 -2.401367 -0.350392
C  -0.491988 -0.998243 -0.968326
C  1.063765 -2.508962 0.417844
C  -1.704304 -1.012504 -3.225944
C  2.754106 -3.62539 -1.138717
C  -4.196234 -0.270845 0.656896
C  3.51442 0.818328 0.083971
C  -5.046156 0.751944 0.112723
C  4.93063 0.68321 0.285526
C  -4.592045 -0.930232 1.852218
C  2.959754 2.11722 -0.072494
C  -6.300365 1.006262 0.733463
C  5.745847 1.847352 0.228628
C  -5.826728 -0.647761 2.463705
C  3.782295 3.257919 -0.103921
C  -6.697894 0.312849 1.892385
C  5.186744 3.123689 0.028178
C  -4.606561 1.669756 -0.975457
C  5.565966 -0.595118 0.712362
H  -0.320472 -3.175769 -1.141888
H  -1.100574 -2.602894 0.355772
H  -0.555361 -0.247039 -0.161531
H  0.34651 -0.727186 -1.633109
H  1.110433 -3.478723 0.949036
H  1.149187 -1.693298 1.157083
H  -1.276555 -1.979272 -3.553161
H  -1.097252 -0.194469 -3.656849
H  -2.737179 -0.928584 -3.595199
H  3.651572 -3.346263 -1.71026
H  3.020885 -4.41264 -0.407996
H  1.990902 -4.029819 -1.82944
H  -3.914595 -1.684141 2.2660
H  1.874386 2.198277 -0.190832
H  -6.945758 1.775849 0.300776
H  6.824163 1.731998 0.369238
H  -6.11566 -1.178865 3.377467
H  3.332991 4.248062 -0.237954
H  -7.664296 0.532212 2.357756
H  5.833752 4.006304 -0.00289
H  -5.361153 2.840264 -2.355873
H  7.316056 -1.47961 0.717746
