program: Gaussian 09
title: 000003489
version: EM64L-G09RevD.01
frameworkgroup: C1[X(C12H15N3O2S2)]
method: RPBEPBE
basis: SDD
operation: Freq
keyword: #p
keyword: freq=noraman
keyword: PBEPBE/SDD
title: #p freq=noraman PBEPBE/SDD
converged: YES YES NO NO
title: Mulliken charges:
elementType: S S O O N N N C C C C C C C C C C C C H H H H H H H H H H H H H H H
charge: 0.187136 1.015105 -0.472677 -0.482633 -0.037984 -0.603536 -0.055956 0.225858 -0.157944 -0.681454 -0.677247 -0.680560 -0.036405 -0.099814 -0.259511 -0.236217 -0.198901 -0.200048 -0.212558 0.199511 0.233967 0.230596 0.232485 0.217189 0.213529 0.217706 0.231975 0.212579 0.350302 0.294497 0.292113 0.247799 0.247949 0.243150
chargesum: 0.00000
title: Mulliken charges with hydrogens summed into heavy atoms:
elementType: S S O O N N N C C C C C C C C C C C C
charge: 0.187136 1.015105 -0.472677 -0.482633 -0.037984 -0.253234 -0.055956 0.225858 -0.157944 -0.017380 -0.014044 -0.018301 -0.036405 -0.099814 0.034986 0.055895 0.048899 0.047900 0.030592
polarizability: 3.11518798e+02 1.76795296e+01 1.67325963e+02 7.69668671e-01 -1.68544367e+00 1.58802864e+02
1716.lowfreq: -15.5343 -4.6129 -1.7277 -0.0012 -0.0007 0.0014 10.0015 13.0938 31.1856
frequency: -7.0191 11.8365 31.1765 33.1460 38.3919 84.0119 90.3687 139.6418 145.2624 179.1642 189.9143 201.1460 204.0278 236.0209 248.4273 253.5642 261.7085 268.4558 297.0794 313.1921 345.2840 357.5473 373.3554 401.9562 403.8397 425.4664 447.2644 481.8232 515.3948 566.0407 574.7080 582.2465 601.4360 609.3897 652.2031 677.7335 690.5607 750.8425 763.8075 809.8096 827.3070 854.2718 926.3844 933.0167 938.6392 953.7929 957.7547 967.1920 977.2542 986.8364 1003.9978 1007.8555 1008.7257 1023.3865 1032.9368 1048.3759 1078.4262 1127.9732 1174.9436 1179.1674 1204.8391 1215.7764 1249.5113 1296.3222 1304.8704 1376.5752 1380.1261 1383.3154 1404.3095 1436.8191 1451.5649 1452.2376 1460.6550 1462.6880 1466.3219 1473.6414 1478.4722 1487.7858 1504.2592 1575.5057 1603.2429 2977.0952 2979.7439 2992.6820 3073.7605 3079.1100 3084.5667 3087.7482 3093.8752 3107.1284 3141.1048 3149.6811 3157.2687 3166.7765 3177.1640 3534.5701
redmass: 3.2163 5.7729 6.8323 7.1994 5.2026 6.6039 4.8214 5.4516 7.0116 3.6740 1.1816 3.4309 3.1199 3.5573 5.3528 1.3551 1.2226 1.6004 3.1222 2.9347 3.6728 3.9959 9.2025 3.9416 2.8642 7.7378 4.4598 3.9340 3.7451 7.4511 9.1329 5.7722 6.4773 7.7292 6.6990 7.5871 2.5150 4.9075 1.5906 3.4129 15.7135 1.2393 1.7408 1.7085 1.3407 1.2048 4.1038 12.4381 6.0895 1.4015 4.4457 4.1245 1.3484 1.3903 1.4727 2.1437 1.5675 3.1932 1.0567 1.1249 2.8373 3.0927 2.8411 1.7259 1.2978 1.1818 1.1886 8.2317 1.2498 2.2551 1.0481 2.0178 1.1250 1.0488 2.7648 1.0502 1.0754 2.9715 1.8012 5.7603 6.9095 1.0346 1.0349 1.0360 1.1003 1.0996 1.1010 1.1003 1.0994 1.1001 1.0860 1.0886 1.0928 1.0971 1.1017 1.0790
irintensity: 0.7070 0.5429 2.4070 0.6307 0.2281 1.3850 1.6725 1.9662 0.4242 19.1049 0.2130 27.3554 30.1482 15.2918 5.3052 6.5449 4.9623 15.6965 9.5785 3.4897 3.4792 4.7066 46.7276 67.4309 3.6525 122.5860 0.8035 33.1431 5.5521 65.8785 15.7453 86.1260 0.0159 0.9374 21.6200 13.7753 45.1743 26.1789 83.7439 9.6895 67.9464 0.9229 1.9387 1.1356 2.4370 0.1794 74.7850 76.9594 2.6968 0.1074 72.9060 5.7879 0.2418 0.1084 7.6388 28.3544 2.9101 9.8841 0.1503 12.8457 7.9938 4.8073 13.1846 145.8164 3.4620 19.1196 23.2966 6.4535 5.4813 17.4048 0.0659 21.3024 1.9958 1.2491 80.1857 12.1697 23.3196 390.0804 11.6734 3.0790 0.4012 22.2184 25.3089 34.9701 1.9243 71.5308 12.9720 11.8985 67.8178 25.5927 1.3216 9.0045 0.7449 2.6857 26.6064 44.5016
temp: 298.150 k
press: 1.00000 atm
elementType: 16 16 8 8 7 7 7 6 6 6 6 6 6 6 6 6 6 6 6 1 1 1 1 1 1 1 1 1 1 1 1 1 1 1
symmnumber: 1
zpe: 662351.9 jmol-1
zpe.correction: 0.252277 hartree
zpe.thermalcorrener: 0.272063 hartree
zpe.thermalcorrenthalpy: 0.273008 hartree
zpe.thermalcorrgfe: 0.201880 hartree
zpe.sumelectzpe: -1575.470374 hartree
zpe.sumelectthermal: -1575.450588 hartree
zpe.sumelectthermalent: -1575.449643 hartree
zpe.sumelectthermalfe: -1575.520771 hartree
dipole: -3.0181 -7.8174 0.2660
dipole: 8.3840
quadrupole: -85.4359 -140.5039 -125.9951
quadrupole: 10.0387 0.4602 -0.5502
quadrupole: 31.8758 -23.1923 -8.6835 10.0387 0.4602 -0.5502
hfenergy: -1575.722651 hartree
pointgroup: C01 [X(C12H15N3O2S2)]
dipole: 1.2953436 2.8616769 -1.0065034 debye
polarizability: 312.5940812|11.6186264|166.4567557|-4.6552072|-1.2465182|158.5967887 unknown
InChI: InChI=1S/C12H15N3O2S2/c1-12(2,3)10-13-14-11(18-10)15-19(16,17)9-7-5-4-6-8-9/h4-8,15H,1-3H3
charge 0 multiplicity 1
34 atoms
S  -2.037897 1.377368 -0.445126
S  1.683405 -1.105442 0.592442
O  1.625171 -2.427128 -0.330831
O  1.548086 -1.176129 2.205381
N  -2.852635 -1.031599 0.408016
N  0.488371 0.184217 -0.126104
N  -1.453749 -1.107357 0.413092
C  -4.83298 0.471308 -0.102159
C  -3.360455 0.121581 0.012933
C  -5.678651 -0.734304 0.389766
C  -5.174879 0.777864 -1.590809
C  -5.143556 1.720303 0.774367
C  -0.874977 0.021974 0.002793
C  3.253266 -0.127604 0.169655
C  3.815894 0.671559 1.177884
C  3.806939 -0.299332 -1.109447
C  5.009414 1.364928 0.866025
C  4.999706 0.404072 -1.398933
C  5.59215 1.233843 -0.416922
H  -6.751846 -0.486029 0.295828
H  -5.466237 -1.6380 -0.205479
H  -5.456893 -0.970821 1.444088
H  -4.950803 -0.091569 -2.233892
H  -6.251596 1.010874 -1.682073
H  -4.601511 1.644196 -1.968807
H  -6.22155 1.956666 0.710938
H  -4.890028 1.533055 1.832839
H  -4.57721 2.606856 0.43404
H  0.905433 1.115868 -0.213867
H  3.35402 0.725987 2.169405
H  3.336874 -0.968541 -1.837315
H  5.48235 1.996814 1.624546
H  5.464624 0.298222 -2.384313
H  6.51805 1.771001 -0.648764
