program: Gaussian 09
title: 000293300
version: EM64L-G09RevD.01
frameworkgroup: C1[X(C24H23N5O4S)]
method: RPBEPBE
basis: SDD
operation: Freq
keyword: #p
keyword: freq=noraman
keyword: PBEPBE/SDD
title: #p freq=noraman PBEPBE/SDD
converged: YES YES NO NO
title: Mulliken charges:
elementType: S O O O O N N N N N C C C C C C C C C C C C C C C C C C C C C C C C H H H H H H H H H H H H H H H H H H H H H H H
charge: 0.278653 -0.241042 -0.409340 -0.422349 -0.335511 -0.150863 -0.048647 -0.021709 -0.462572 -0.000838 -0.364216 -0.391654 -0.353479 -0.573237 0.126271 0.101416 -0.226053 0.212479 -0.351169 0.555177 -0.387426 -0.799204 -0.601618 -0.363913 0.475496 0.194552 0.107856 -0.314440 -0.375363 -0.378330 -0.220970 -0.220446 -0.235701 0.167632 0.206097 0.237279 0.219601 0.247567 0.242356 0.213192 0.247024 0.224699 0.270246 0.315205 0.247453 0.292511 0.289561 0.252823 0.312141 0.270796 0.237943 0.237179 0.227796 0.227527 0.229953 0.390100 0.391507
chargesum: 0.00000
title: Mulliken charges with hydrogens summed into heavy atoms:
elementType: S O O O O N N N N N C C C C C C C C C C C C C C C C C C C C C C C C
charge: 0.278653 -0.241042 -0.019239 -0.030842 -0.335511 -0.150863 -0.048647 -0.021709 -0.147367 -0.000838 0.079160 0.075514 0.102070 -0.101513 0.126271 0.101416 0.044193 0.212479 -0.351169 0.555177 -0.139973 -0.217132 -0.348795 -0.051772 0.475496 0.194552 0.107856 -0.043644 -0.137421 -0.141151 0.006826 0.007081 -0.005748 0.167632
polarizability: 5.89320585e+02 -1.91598524e+01 2.96663767e+02 3.46147192e+01 6.91230157e+00 2.02093580e+02
1716.lowfreq: -6.7654 -4.7685 -0.0011 0.0005 0.0014 0.4976 3.0562 6.6954 10.4886
frequency: -5.0212 6.6330 10.2416 12.6259 19.2100 24.6226 35.5525 43.5656 59.9227 61.4781 68.9403 91.0734 100.4466 107.1038 113.8485 121.6617 132.1357 143.6074 161.8425 178.4662 210.9865 227.5304 237.4614 238.9713 261.3486 270.7979 288.8583 301.6626 309.1244 321.6758 339.8925 390.9887 401.5389 410.4729 424.3306 444.7588 452.2457 472.4597 511.5814 527.9852 539.9134 549.2284 559.6228 569.9698 571.0710 571.9885 613.2984 616.6146 622.7568 627.4618 644.0134 649.0934 659.3320 674.5337 687.3255 702.0460 706.4794 723.3292 739.5434 743.4490 752.8009 775.2131 776.4195 790.1794 796.5300 807.6585 817.9049 833.7670 849.6765 852.2050 858.4527 875.3848 882.9251 896.5287 905.7002 917.3212 919.3678 926.7334 969.1512 977.3076 989.9254 996.8834 998.2131 1023.1312 1026.5131 1031.6721 1051.7056 1067.4428 1073.8593 1081.1857 1096.6395 1106.5688 1122.0387 1124.6938 1154.3867 1166.8066 1173.1554 1175.8052 1188.1981 1193.4901 1204.3171 1215.5032 1219.1044 1237.4630 1244.7559 1248.8876 1257.1261 1285.7154 1288.7008 1295.4787 1301.8166 1309.9622 1312.9504 1325.2442 1327.7420 1351.5898 1357.1235 1363.9238 1368.0677 1369.6203 1384.2359 1391.5258 1404.2133 1435.7567 1439.7979 1442.7620 1443.5376 1450.4537 1468.1373 1472.0849 1484.2373 1486.4281 1492.7868 1496.0254 1516.0065 1542.9455 1582.9066 1585.5689 1593.2725 1614.0206 1629.3781 1659.6890 2968.0857 2980.2545 2992.0234 3012.3056 3013.9662 3020.2359 3033.9075 3053.9751 3061.5229 3080.7413 3122.3650 3124.4716 3129.6611 3137.2539 3147.1065 3148.8598 3165.3281 3168.5597 3169.3803 3208.8782 3227.2493 3522.5442 3532.2688
redmass: 5.2165 6.6198 6.4986 5.8398 5.1230 4.9625 6.0144 5.5860 5.2926 7.7062 3.4674 3.7131 3.1842 4.0724 6.4682 4.7823 5.8471 4.9304 6.9262 5.7498 5.9835 3.8509 5.5210 5.4233 5.5148 4.8612 5.1705 6.1658 6.1443 2.2443 6.1958 5.6504 2.8011 11.8304 4.4196 6.2155 3.0232 3.9752 5.2429 4.6872 5.1652 6.1520 3.9163 1.5887 3.2865 5.8873 4.0724 6.3308 2.6569 7.2052 4.8989 4.9387 6.9706 1.7341 2.7886 1.6563 5.3141 4.8883 1.1574 4.8574 3.2973 2.4493 2.2856 5.2358 1.9060 4.4712 7.8627 1.6341 1.1780 1.2505 1.4048 1.6720 1.5392 2.4188 6.0473 2.4240 1.4346 1.4640 3.9984 1.3911 5.9976 1.3303 1.3103 5.0483 2.1965 3.7618 3.4445 2.4554 1.4880 2.7131 2.7125 2.4748 1.0851 1.6708 4.0393 2.0978 1.0522 1.5868 1.1148 2.2803 1.6656 1.7459 2.0637 1.6791 1.5504 1.4935 1.5469 1.3955 6.1399 1.1652 3.9559 1.9788 2.0157 1.2790 1.5622 1.9076 1.7829 2.6242 2.6836 2.1110 8.7586 1.6333 6.1446 2.3554 2.1986 1.1180 1.1133 2.7952 1.3459 1.1192 2.3506 1.1066 2.2081 3.3035 8.2469 8.3001 4.1023 5.5861 6.0949 6.1297 4.5892 5.1203 1.0594 1.0610 1.0606 1.0591 1.0689 1.0980 1.1012 1.0582 1.1038 1.1061 1.0851 1.0894 1.1067 1.0921 1.0922 1.0965 1.1017 1.0921 1.0909 1.0954 1.0983 1.0763 1.0641
irintensity: 0.0395 0.0176 0.0897 0.0870 0.0549 0.0976 0.3253 0.9057 2.1426 5.3047 4.1180 0.3497 1.7198 0.6290 1.2882 2.4775 2.9284 1.8069 0.3767 2.4395 0.5719 3.5777 1.7519 1.1049 0.1693 4.9996 2.0065 0.1835 3.7439 0.5567 21.3352 9.5169 0.0075 8.9297 7.6253 9.4086 21.2984 6.5005 17.9290 1.8112 0.5732 4.8567 8.2096 86.8521 40.5026 44.3601 17.6454 0.1233 10.2362 2.7307 18.2324 25.4572 4.5367 83.6366 12.9263 60.3366 3.9205 8.0558 10.8882 23.1564 0.0967 14.5270 15.0735 7.6173 0.3038 29.2234 25.1603 12.4210 190.3490 0.0085 25.0787 38.6340 0.4409 36.8387 72.6791 19.1113 10.8021 1.9802 16.6828 0.0199 0.6634 0.1233 1.1554 253.0275 6.8668 99.3260 14.9805 10.1113 8.5302 7.4010 8.6733 8.5146 1.7984 158.6664 61.3443 138.6424 0.0284 65.7565 1.9581 1.6392 260.6111 23.0010 6.2276 34.8729 14.9831 19.6325 65.4862 22.6656 100.9306 5.0492 52.0024 200.4229 56.2483 0.2572 50.6657 47.0147 139.2635 26.9430 458.0308 1.5301 0.1335 60.9622 35.0130 58.4985 8.4702 10.0948 24.6420 206.8518 38.9373 2.7225 15.2692 25.6276 432.7501 126.1770 262.3640 98.7901 26.2603 234.7624 1.0134 3.1348 150.7749 450.6265 9.8991 3.1950 28.4370 45.2083 304.3293 8.4338 0.7414 5.8963 19.0146 31.1141 6.7810 0.3227 2.9965 16.4014 5.4004 40.2090 27.9392 15.4766 1.2998 7.4624 0.0857 14.0790 86.0009
temp: 298.150 k
press: 1.00000 atm
elementType: 16 8 8 8 8 7 7 7 7 7 6 6 6 6 6 6 6 6 6 6 6 6 6 6 6 6 6 6 6 6 6 6 6 6 1 1 1 1 1 1 1 1 1 1 1 1 1 1 1 1 1 1 1 1 1 1 1
symmnumber: 1
zpe: 1143953.4 jmol-1
zpe.correction: 0.435709 hartree
zpe.thermalcorrener: 0.465854 hartree
zpe.thermalcorrenthalpy: 0.466798 hartree
zpe.thermalcorrgfe: 0.367097 hartree
zpe.sumelectzpe: -1898.691634 hartree
zpe.sumelectthermal: -1898.661489 hartree
zpe.sumelectthermalent: -1898.660545 hartree
zpe.sumelectthermalfe: -1898.760245 hartree
dipole: 0.8161 0.0862 -0.0558
dipole: 0.8225
quadrupole: -204.5048 -209.8032 -206.7750
quadrupole: -21.8572 -2.8818 -6.4046
quadrupole: 2.5229 -2.7755 0.2527 -21.8572 -2.8818 -6.4046
hfenergy: -1899.1273425 hartree
pointgroup: C01 [X(C24H23N5O4S1)]
dipole: -0.320996 -0.0394199 -0.0111161 debye
polarizability: 589.0335288|-25.2724192|288.7042661|-32.5258266|-26.7320129|210.3401366 unknown
InChI: InChI=1S/C24H23N5O4S/c30-19-12-17(9-10-18(19)24(32)33)28-20(31)8-4-5-11-29-15-27-21-22(29)25-14-26-23(21)34-13-16-6-2-1-3-7-16/h1-3,6-7,9-10,12,14-15,28,30,32H,4-5,8,11,13H2
charge 0 multiplicity 1
57 atoms
S  6.755052 0.3604 -0.448165
O  -4.654451 1.898096 -0.797558
O  -8.938057 -3.014115 0.69705
O  -11.474653 0.3645 0.192618
O  -11.280084 -1.893454 0.670739
N  2.005807 2.094104 -0.356849
N  4.05669 2.103579 -1.405326
N  2.501809 0.514636 1.487248
N  -5.052562 -0.355467 -0.256206
N  4.817923 -0.290548 1.408841
C  -0.336548 1.220581 -0.573408
C  0.581833 2.362974 -0.083543
C  -1.819244 1.510297 -0.259782
C  -2.741452 0.360335 -0.721006
C  2.823266 1.229086 0.372766
C  4.093814 1.24938 -0.288824
C  2.798284 2.58162 -1.408045
C  -4.226758 0.726343 -0.591972
C  5.106222 0.436377 0.288476
C  -6.463621 -0.396398 -0.113142
C  3.557216 -0.218612 1.944833
C  7.603518 -0.852656 0.781143
C  -7.036878 -1.647417 0.216715
C  -7.290409 0.757732 -0.28859
C  9.006273 -1.133651 0.303075
C  -8.432042 -1.773144 0.376063
C  -9.275937 -0.619384 0.201037
C  -8.674093 0.626513 -0.129702
C  10.089641 -0.317937 0.721719
C  9.267332 -2.221886 -0.569926
C  11.405012 -0.586303 0.282605
C  10.581769 -2.492902 -1.009917
C  11.655016 -1.675431 -0.58462
C  -10.714475 -0.78368 0.373377
H  -0.200032 1.084582 -1.664781
H  -0.017902 0.280917 -0.083061
H  0.314353 3.316946 -0.573371
H  0.467055 2.493646 1.007678
H  -2.152156 2.440496 -0.757044
H  -1.949639 1.669779 0.828884
H  -2.545406 0.14698 -1.792293
H  -2.506907 -0.568296 -0.163898
H  2.407229 3.286318 -2.139887
H  -4.573219 -1.246173 -0.10155
H  3.383472 -0.820007 2.841599
H  6.966121 -1.748526 0.813215
H  7.571047 -0.362265 1.76549
H  -6.422534 -2.543697 0.355497
H  -6.831224 1.713705 -0.539751
H  -9.323943 1.496818 -0.259291
H  9.898558 0.528224 1.392723
H  8.436799 -2.855632 -0.903612
H  12.232092 0.050356 0.616086
H  10.769042 -3.338543 -1.681071
H  12.67525 -1.885247 -0.924877
H  -9.953466 -2.932648 0.774516
H  -12.434105 0.142504 0.332074
