program: Gaussian 09
title: 000293500
version: EM64L-G09RevD.01
frameworkgroup: C1[X(C20H12F12N2O4)]
method: RPBEPBE
basis: SDD
operation: Freq
keyword: #p
keyword: freq=noraman
keyword: PBEPBE/SDD
title: #p freq=noraman PBEPBE/SDD
converged: YES YES NO NO
title: Mulliken charges:
elementType: F F F F F F F F F F F F O O O O N N C C C C C C C C C C C C C C C C C C C C H H H H H H H H H H H H
charge: -0.116599 -0.150833 -0.143025 -0.144845 -0.125516 -0.153368 -0.117156 -0.155309 -0.159622 -0.174805 -0.124920 -0.144056 -0.539309 -0.438829 -0.154190 -0.153234 -0.304856 -0.042481 0.072692 0.092503 -0.627801 -0.652651 0.357086 0.387363 0.368895 0.351938 0.405403 0.142951 -0.305875 -0.263847 0.132385 0.120953 -0.162712 -0.166571 -0.290948 -0.285678 0.029325 0.000610 0.298647 0.285597 0.277213 0.282024 0.466266 0.422059 0.255809 0.269793 0.260109 0.252276 0.287068 0.280069
chargesum: 0.00000
title: Mulliken charges with hydrogens summed into heavy atoms:
elementType: F F F F F F F F F F F F O O O O N N C C C C C C C C C C C C C C C C C C C C
charge: -0.116599 -0.150833 -0.143025 -0.144845 -0.125516 -0.153368 -0.117156 -0.155309 -0.159622 -0.174805 -0.124920 -0.144056 -0.073043 -0.016770 -0.154190 -0.153234 -0.304856 -0.042481 0.072692 0.092503 -0.043557 -0.093413 0.357086 0.387363 0.368895 0.351938 0.405403 0.142951 -0.050066 0.005947 0.132385 0.120953 0.097397 0.085706 -0.003879 -0.005608 0.029325 0.000610
polarizability: 2.64603767e+02 1.29885601e+01 2.34049677e+02 -3.29639299e+01 1.30723697e+01 2.40103679e+02
1716.lowfreq: -4.0481 -0.0004 -0.0001 0.0010 2.2396 7.0948 15.3389 20.9399 26.0137
frequency: 15.2486 20.9049 25.9727 35.2299 42.8726 46.6686 46.9858 51.5759 56.3738 65.1957 72.5893 79.1449 82.9807 105.5353 121.7795 143.9672 147.9309 153.2287 156.4976 175.3885 187.7952 193.7242 200.2024 231.3897 236.1217 243.8876 250.7758 258.7393 266.3203 275.3663 278.2778 286.3233 295.2710 299.5368 302.6967 315.9388 325.3585 330.9137 351.3199 390.4483 405.5413 415.1548 424.5040 432.8318 442.6883 458.9501 460.9220 461.1469 467.2366 473.7510 488.6720 489.9915 496.2856 523.8616 548.4547 559.4273 586.6762 593.0586 607.2357 614.9265 635.1974 642.9078 656.5713 682.4221 692.1431 694.7610 720.5725 740.7547 750.4345 771.1149 795.0068 799.7797 823.1167 838.1330 852.4181 864.5063 888.2955 930.5723 930.9567 943.2320 947.1086 947.8945 966.6312 979.2465 986.2121 990.9519 998.1606 1011.0463 1012.3151 1022.8417 1037.1386 1041.5055 1051.5176 1055.9424 1059.0797 1068.2379 1077.7317 1078.9291 1089.8553 1097.1923 1111.0164 1134.3830 1152.3796 1165.7818 1172.0631 1177.1860 1179.0350 1181.8199 1220.4794 1230.4350 1244.9663 1263.2698 1292.3256 1303.1531 1329.1305 1334.7913 1352.4129 1359.3235 1395.4662 1399.8695 1407.4390 1440.5792 1450.4273 1453.4313 1468.4509 1524.4044 1561.4839 1569.9831 1579.5311 1583.4607 1594.5612 1600.2636 2014.5132 2898.6399 3013.4738 3041.3399 3085.0241 3107.3685 3154.2440 3154.9314 3170.6079 3172.4922 3185.5697 3185.7206
redmass: 10.9127 8.2137 9.9781 10.2489 10.4691 10.6397 15.4817 14.3279 12.4879 14.3407 12.6514 13.1978 11.1841 8.4336 9.4067 10.7304 6.0940 8.9409 9.3708 9.5766 9.9084 6.0162 8.3892 6.3226 5.9604 9.3917 8.3774 12.8854 10.0580 10.8044 10.7444 10.0413 7.3900 16.1178 9.4351 9.2027 6.5176 5.9070 2.7061 7.6660 10.2792 7.9930 4.0622 3.8391 6.7229 15.2031 17.4009 11.4361 11.3613 9.1789 13.6090 13.8697 6.0995 5.9641 11.0468 8.8939 6.7732 6.7286 8.4175 10.9878 9.2893 10.9827 10.1282 8.0377 6.5007 7.5211 6.1734 2.5977 2.0497 2.9165 2.8124 4.2912 2.7169 2.3666 2.9711 1.6178 4.0495 1.8518 3.0082 1.4646 2.8545 4.0860 6.7241 7.9292 5.5416 4.8344 6.0091 1.3889 1.4155 4.7729 8.0224 8.4869 5.9109 6.5385 7.7227 5.1964 6.8807 1.9127 2.8872 6.1218 3.3036 2.8511 3.1458 3.1819 1.1466 1.1628 3.3275 2.1567 1.8007 1.9737 2.1894 2.2869 1.7450 3.2685 4.7971 1.6237 3.5912 2.2714 2.0897 1.9331 1.8134 1.4934 1.6065 2.6977 1.0805 1.4323 6.5600 6.4510 6.8244 6.3448 10.8064 8.3437 1.0654 1.0785 1.0631 1.0610 1.0976 1.1024 1.0890 1.0887 1.0948 1.0947 1.0989 1.0987
irintensity: 2.2475 1.5917 1.8531 1.0815 1.4775 0.1830 0.3969 0.7467 0.2615 0.7411 0.4667 0.4000 2.0410 4.0426 2.2704 1.3149 1.0243 1.9097 2.4112 1.0106 2.4756 1.3078 2.2540 4.7462 1.5764 5.6429 10.2541 1.5940 2.4037 2.6846 0.7613 2.7616 7.5182 2.7260 0.6970 3.6770 7.5259 5.6192 11.1834 5.7859 7.8964 30.3047 1.5582 3.9058 15.8412 2.5252 4.2329 8.5939 2.1776 6.0885 2.0137 1.6553 0.3498 6.4804 5.5843 11.8010 1.0359 25.0792 35.6788 33.4110 41.7551 19.7630 15.1274 2.0868 12.8791 5.2429 9.8835 37.0148 22.1791 13.2090 26.3105 42.4271 17.3983 15.7687 9.8273 110.1783 32.4242 70.0996 129.2588 12.7138 36.2513 67.6077 17.1281 75.4268 30.9647 27.8683 62.6883 1.3382 0.0985 177.0244 45.6623 15.6198 124.3550 163.6624 299.1732 96.1790 40.7640 23.9465 92.1611 62.6376 16.9247 93.6816 273.9595 174.1784 2.6368 5.8622 123.6283 301.7625 38.7376 8.9623 110.8751 11.8542 21.2838 24.9101 5.9213 24.7758 1.5998 60.0989 109.5380 26.5209 41.2497 101.7951 19.7412 18.6427 16.8392 660.6082 31.6181 63.5088 83.0184 45.3053 105.7456 37.9648 1028.7094 1244.1568 4.0265 1.7949 1.0672 0.6970 3.9621 4.6668 3.4343 1.3083 4.8241 2.0305
temp: 298.150 k
press: 1.00000 atm
elementType: 9 9 9 9 9 9 9 9 9 9 9 9 8 8 8 8 7 7 6 6 6 6 6 6 6 6 6 6 6 6 6 6 6 6 6 6 6 6 1 1 1 1 1 1 1 1 1 1 1 1
symmnumber: 1
zpe: 793766.9 jmol-1
zpe.correction: 0.302330 hartree
zpe.thermalcorrener: 0.337131 hartree
zpe.thermalcorrenthalpy: 0.338075 hartree
zpe.thermalcorrgfe: 0.233390 hartree
zpe.sumelectzpe: -2375.038703 hartree
zpe.sumelectthermal: -2375.003902 hartree
zpe.sumelectthermalent: -2375.002958 hartree
zpe.sumelectthermalfe: -2375.107643 hartree
dipole: -3.9926 -1.4970 3.2602
dipole: 5.3676
quadrupole: -218.7301 -227.5456 -196.8937
quadrupole: -19.2842 -29.9738 15.8525
quadrupole: -4.3403 -13.1558 17.4961 -19.2842 -29.9738 15.8525
hfenergy: -2375.341033 hartree
pointgroup: C01 [X(C20H12F12N2O4)]
dipole: 0.7858418 0.5406464 1.8840812 debye
polarizability: 232.3826802|1.1187474|246.1151003|38.0836513|6.4842785|260.2593421 unknown
InChI: InChI=1S/C20H12F12N2O4/c21-17(22,23)15(37,18(24,25)26)7-9-3-1-5-11(33-9)13(35)14(36)12-6-2-4-10(34-12)8-16(38,19(27,28)29)20(30,31)32/h1-6,37-38H,7-8H2
charge 0 multiplicity 1
50 atoms
F  1.290553 -1.935277 -2.903951
F  2.944021 -2.967303 -1.738444
F  0.791794 -3.131637 -1.055039
F  3.12711 1.144045 -0.605103
F  3.064812 0.117485 -2.616034
F  4.372989 -0.709514 -0.959363
F  -3.422993 -3.019222 -2.473946
F  -4.989292 -2.127634 -1.102493
F  -4.156441 -0.912631 -2.822284
F  -1.277522 -1.748124 1.028497
F  -2.111776 -3.534526 -0.08567
F  -3.465704 -2.297884 1.238903
O  0.710095 -0.20076 -0.783503
O  -1.554646 -1.152442 -1.736678
O  -0.551778 3.488078 2.890203
O  1.126359 4.234633 0.360836
N  1.192331 0.677319 1.500026
N  -1.529472 1.856299 0.034445
C  1.916306 -0.986556 -0.706094
C  -2.696591 -1.24698 -0.891969
C  2.18446 -1.46259 0.7576
C  -3.217826 0.125907 -0.289032
C  1.731543 -2.244328 -1.620013
C  3.117154 -0.116962 -1.238808
C  -3.799383 -1.848742 -1.820898
C  -2.408966 -2.225561 0.303945
C  1.991581 -0.385302 1.816573
C  -2.443507 1.316798 -0.818422
C  2.552601 -0.511589 3.109049
C  -2.632444 1.836945 -2.128121
C  0.917514 1.633969 2.433835
C  -0.771565 2.91097 -0.401715
C  2.249845 0.457234 4.089112
C  -1.854089 2.93224 -2.562097
C  1.413822 1.543585 3.753732
C  -0.894264 3.483989 -1.687042
C  0.091145 2.828641 2.033103
C  0.224825 3.385728 0.591379
H  1.453477 -2.266372 0.966304
H  3.190826 -1.905169 0.841258
H  -4.293557 0.231944 -0.507891
H  -3.103613 0.118958 0.806244
H  0.71702 0.394726 0.140919
H  -0.713347 -0.748397 -1.306488
H  3.206713 -1.358414 3.336972
H  -3.364074 1.369296 -2.791855
H  2.665957 0.369663 5.097329
H  -1.986959 3.337379 -3.569906
H  1.147734 2.323181 4.472055
H  -0.248683 4.320405 -1.970056
