program: Gaussian 09
title: 000293242
version: EM64L-G09RevD.01
frameworkgroup: C1[X(C19H21BrN2O2)]
method: RPBEPBE
basis: SDD
operation: Freq
keyword: #p
keyword: freq=noraman
keyword: PBEPBE/SDD
title: #p freq=noraman PBEPBE/SDD
converged: YES YES NO NO
title: Mulliken charges:
elementType: Br O O N N C C C C C C C C C C C C C C C C C C C H H H H H H H H H H H H H H H H H H H H H
charge: -0.040130 -0.234438 -0.230811 -0.491748 0.016875 0.171423 0.032394 0.223067 0.377797 0.358530 -0.677198 -0.815157 -0.459367 -0.837005 -0.839280 0.484801 0.402229 -0.426125 -0.334347 -0.803781 -0.815865 -0.350128 -0.382125 0.381136 0.244934 0.299946 0.241657 0.268202 0.248922 0.250239 0.227604 0.239188 0.253587 0.231044 0.243154 0.232920 0.278998 0.258413 0.227467 0.256234 0.251064 0.235429 0.230296 0.284442 0.285514
chargesum: 0.00000
title: Mulliken charges with hydrogens summed into heavy atoms:
elementType: Br O O N N C C C C C C C C C C C C C C C C C C C
charge: -0.040130 -0.234438 -0.230811 -0.191802 0.016875 0.171423 0.032394 0.223067 0.377797 0.358530 -0.432264 -0.056376 -0.459367 -0.119974 -0.111495 0.484801 0.402229 -0.193205 -0.055349 -0.061667 -0.099076 -0.065686 -0.096611 0.381136
polarizability: 3.85835891e+02 3.17351744e+01 2.62081796e+02 -5.49639232e-01 1.53523444e+01 1.87964430e+02
1716.lowfreq: -34.1682 -6.1674 -0.5283 -0.0004 0.0001 0.0003 4.2688 20.0797 21.3227
frequency: -33.6178 19.9778 21.1734 26.9323 41.4180 45.2102 58.3573 82.0346 87.0678 103.8953 106.5238 116.2786 134.5195 144.3273 149.2883 152.1987 185.8444 201.2807 214.6238 252.9612 258.3256 273.7920 298.4571 314.8538 324.4618 347.8649 349.9436 369.9034 378.5930 410.8560 420.2387 446.4320 466.8746 495.9248 500.6997 514.6060 533.4921 558.4175 561.8272 581.4984 588.3742 627.1844 641.8709 664.3021 666.5616 729.2708 745.5953 773.9514 790.2389 822.4119 828.7432 848.3079 851.0558 877.5260 881.0755 944.1537 960.1277 977.3809 977.8861 991.0693 992.1080 1012.9501 1026.6091 1036.3979 1040.7903 1044.1809 1046.3441 1049.3763 1075.7829 1098.2759 1114.3066 1134.5566 1178.0692 1226.5754 1230.1022 1235.5409 1242.7555 1279.0477 1307.0737 1323.1416 1344.2448 1346.8140 1379.0929 1384.7830 1395.6148 1397.4849 1399.1128 1401.1628 1404.2224 1436.2691 1446.6487 1458.7093 1460.0603 1462.8517 1464.8221 1466.7127 1469.6167 1470.0059 1472.9627 1475.5484 1481.6278 1484.4673 1506.4191 1566.2984 1586.7609 1604.4001 1620.8975 1678.2061 2965.9335 2968.9104 2980.9636 2981.4403 2983.8908 3039.1629 3047.8150 3059.7562 3062.7149 3064.5710 3087.5128 3089.6328 3092.1231 3101.3253 3102.1006 3125.2424 3127.5819 3159.1450 3181.3032 3183.7890 3520.0033
redmass: 1.1348 4.5104 2.6120 1.5707 4.7947 4.4889 4.7709 4.9919 4.7004 3.6321 1.6475 1.7465 3.3740 2.7951 1.4239 2.6123 5.0116 2.6101 1.1600 4.5447 4.0335 5.1600 3.1279 4.3235 3.3464 3.0755 3.2523 3.1049 3.8193 5.7549 2.9859 3.1609 1.4854 3.4559 4.3529 4.0730 3.1685 4.5563 4.1278 5.4506 4.8818 6.8257 4.9275 6.6273 4.9664 4.9565 4.4606 7.3082 6.5948 1.5559 3.0138 3.2518 1.8047 2.1351 1.5329 2.3800 1.2546 1.3240 1.3835 1.7227 1.9814 1.7358 1.9466 1.6877 1.6134 1.6911 1.5708 1.6912 1.6200 3.1253 1.4039 2.5233 1.4130 4.9091 3.0280 2.5429 2.9154 1.5287 1.9753 4.4415 6.2274 6.3422 4.2627 1.2180 1.3067 1.4734 1.2178 1.2426 2.3049 1.9277 3.8357 1.1093 1.0829 1.0510 1.0500 1.0945 1.0605 1.0972 1.1562 1.2604 1.4582 1.5998 2.8369 6.6997 5.7671 5.9066 6.5046 8.1934 1.0377 1.0413 1.0367 1.0371 1.0400 1.0972 1.0926 1.0968 1.0972 1.0921 1.0995 1.0999 1.0989 1.0978 1.0999 1.0915 1.0902 1.0890 1.0946 1.0959 1.0753
irintensity: 0.8368 0.6437 0.0936 0.4288 0.1505 0.5081 0.9903 1.3327 0.1169 0.1699 1.0711 0.5318 0.1466 0.2230 1.1668 0.6063 2.6255 1.8616 0.4523 2.5766 1.3953 3.5893 0.9461 0.3772 4.4343 4.5132 8.2127 8.7786 0.6292 3.6971 4.1881 0.9472 133.2716 0.3240 6.2325 11.7594 1.2362 7.9885 4.2271 12.2228 7.5064 2.3313 7.7025 4.5859 20.1611 6.4140 3.5636 2.6728 44.2895 24.7602 19.0015 8.1410 50.5929 9.9218 8.5987 2.4649 0.6170 2.6503 8.0769 1.4527 0.4433 27.6243 2.6525 8.1577 3.8159 4.9052 2.2453 46.5771 3.7812 11.8483 15.4236 13.6495 289.1087 84.7151 342.6037 238.5226 29.3116 25.3758 34.1573 14.3612 70.3844 37.4226 137.7917 20.7563 20.3511 20.4096 18.6308 6.5566 6.4621 14.1481 1.1320 33.0526 2.7057 6.3977 14.4419 10.5043 0.4996 7.8224 15.0076 35.3889 28.5203 32.9018 165.0801 11.7464 10.3292 22.2012 451.6448 1.5483 30.5072 33.5071 29.5385 25.8202 9.8237 15.1892 14.3374 11.9410 11.3903 11.8097 20.9487 19.2831 22.2941 34.9684 7.6845 21.8548 11.3530 4.1865 0.1982 5.0920 52.2315
temp: 298.150 k
press: 1.00000 atm
elementType: 35 8 8 7 7 6 6 6 6 6 6 6 6 6 6 6 6 6 6 6 6 6 6 6 1 1 1 1 1 1 1 1 1 1 1 1 1 1 1 1 1 1 1 1 1
symmnumber: 1
zpe: 929634.7 jmol-1
zpe.correction: 0.354079 hartree
zpe.thermalcorrener: 0.378910 hartree
zpe.thermalcorrenthalpy: 0.379854 hartree
zpe.thermalcorrgfe: 0.296463 hartree
zpe.sumelectzpe: -1008.219369 hartree
zpe.sumelectthermal: -1008.194538 hartree
zpe.sumelectthermalent: -1008.193594 hartree
zpe.sumelectthermalfe: -1008.276985 hartree
dipole: 8.2792 6.6877 2.7174
dipole: 10.9843
quadrupole: -191.6434 -146.3740 -146.2702
quadrupole: -20.8595 -2.4174 -2.1879
quadrupole: -30.2142 15.0552 15.1590 -20.8595 -2.4174 -2.1879
hfenergy: -1008.5734478 hartree
pointgroup: C01 [X(C19H21Br1N2O2)]
dipole: -3.4074938 2.0070635 -1.7425343 debye
polarizability: 387.916996|-28.3282391|241.4186236|1.5932026|-34.1980066|206.5464974 unknown
InChI: InChI=1S/C19H21BrN2O2/c1-11(2)18(20)17-12(3)10-13(4)19(14(17)5)21-15-6-8-16(9-7-15)22(23)24/h6-10,21H,1-5H3
charge 0 multiplicity 1
45 atoms
Br -2.875378 -2.165628 1.943103
O  6.517971 -1.395746 -0.116193
O  5.419086 -2.049575 1.778652
N  0.767378 1.165567 -1.239203
N  5.458445 -1.443992 0.632096
C  -1.316161 0.042844 -0.478236
C  -0.519168 1.218462 -0.595946
C  -2.587173 0.136365 0.168264
C  -0.984911 2.479985 -0.123916
C  -3.058346 1.388419 0.669863
C  -2.25288 2.537323 0.495864
C  -0.835241 -1.277668 -1.0445
C  -3.425707 -1.07904 0.342592
C  -0.133149 3.727482 -0.266506
C  -4.395164 1.498531 1.379071
C  1.901326 0.507876 -0.761073
C  -4.483371 -1.505671 -0.399568
C  3.096192 0.518222 -1.548993
C  1.912163 -0.162389 0.501593
C  -5.282154 -2.761317 -0.093046
C  -4.928048 -0.710723 -1.619363
C  4.25845 -0.115917 -1.096159
C  3.075095 -0.799342 0.954947
C  4.24388 -0.778508 0.156224
H  -2.613267 3.5009 0.875156
H  0.907416 1.781943 -2.042938
H  -0.175325 -1.120829 -1.9142
H  -0.256273 -1.851885 -0.296135
H  -1.688275 -1.908361 -1.343239
H  0.896952 3.55508 0.094664
H  -0.055254 4.058735 -1.321519
H  -0.563773 4.565777 0.305719
H  -4.466311 0.775882 2.212477
H  -4.545154 2.512641 1.7864
H  -5.236781 1.277902 0.696433
H  3.097634 1.026722 -2.520734
H  1.014344 -0.155112 1.126006
H  -4.632018 -3.654808 -0.059187
H  -6.062176 -2.926798 -0.855513
H  -5.772699 -2.691961 0.895897
H  -4.312967 0.186904 -1.790748
H  -4.878712 -1.345928 -2.525277
H  -5.98502 -0.398385 -1.506875
H  5.178388 -0.116436 -1.68654
H  3.101738 -1.309243 1.921685
