program: Gaussian 09
title: 000293185
version: EM64L-G09RevD.01
frameworkgroup: C1[X(C16H18N2O2)]
method: RPBEPBE
basis: SDD
operation: Freq
keyword: #p
keyword: freq=noraman
keyword: PBEPBE/SDD
title: #p freq=noraman PBEPBE/SDD
converged: YES YES NO NO
title: Mulliken charges:
elementType: O O N N C C C C C C C C C C C C C C C C H H H H H H H H H H H H H H H H H H
charge: -0.264537 -0.264538 -0.123305 -0.123306 0.497522 0.497522 0.060615 0.060616 -0.494292 -0.494293 0.201505 0.201507 -0.345557 -0.345560 -0.340359 -0.340358 -0.809021 -0.809022 -0.501377 -0.501376 0.262136 0.262136 0.233741 0.233742 0.252862 0.252861 0.225033 0.229341 0.229422 0.229446 0.225033 0.229317 0.218489 0.233899 0.233883 0.233861 0.233922 0.218489
chargesum: 0.00000
title: Mulliken charges with hydrogens summed into heavy atoms:
elementType: O O N N C C C C C C C C C C C C C C C C
charge: -0.264537 -0.264538 -0.123305 -0.123306 0.497522 0.497522 0.060615 0.060616 -0.232156 -0.232156 0.201505 0.201507 -0.111816 -0.111818 -0.087497 -0.087496 -0.125225 -0.125226 0.184895 0.184895
polarizability: 4.00847830e+02 7.04115641e+00 2.44287689e+02 1.98657100e-02 1.30841716e-02 9.37481975e+01
1716.lowfreq: -9.4297 -0.0006 0.0002 0.0007 2.0656 4.5182 8.9932 42.6879 52.7929
frequency: 8.9932 42.6879 52.6704 55.7399 69.1940 74.7231 78.9355 129.8707 138.6192 151.0946 161.0372 165.8415 201.9107 240.9515 248.6348 268.2712 272.7792 274.9515 326.9474 339.2582 344.5186 350.7213 380.4796 429.7892 448.3513 471.5069 499.6181 530.4437 542.3683 556.9808 585.8333 599.2212 633.6245 697.1200 717.6091 723.0271 725.2459 744.4015 814.7663 823.7766 824.1553 903.9333 905.1524 936.2791 950.7890 963.3526 964.0068 975.3203 976.6770 1011.7171 1015.8114 1047.7446 1047.9533 1089.8417 1114.1284 1114.3608 1119.6916 1142.6147 1150.9597 1156.9202 1156.9384 1213.9865 1214.9990 1230.6890 1245.2239 1261.1321 1263.8175 1333.0090 1383.0919 1385.6849 1396.8603 1397.4010 1399.1471 1402.5246 1437.7766 1440.0869 1446.7028 1446.8666 1453.1536 1453.9750 1469.9874 1470.0075 1474.2978 1475.6824 1483.3718 1486.9735 1560.7553 1563.9975 1620.0609 1621.0559 2973.5419 2973.6500 2989.3212 2989.5988 3050.6314 3050.6532 3083.1465 3083.1526 3095.3413 3096.1041 3115.5606 3116.0673 3127.5848 3127.6246 3160.8910 3161.0889 3169.1325 3169.2720
redmass: 4.2982 3.3069 2.8737 4.4366 1.7571 1.0432 1.5965 4.2342 3.7497 4.5095 4.1253 4.6784 2.2830 3.0367 1.1929 3.1926 1.5558 3.3946 3.0195 4.3017 4.1327 3.0867 5.3657 5.4246 7.0369 3.3894 3.1384 6.2996 4.1775 3.3504 3.8814 5.4438 7.5534 5.1896 5.0918 6.5822 3.7765 3.8031 6.4726 1.4018 1.4018 1.3809 1.4208 2.7110 2.3949 1.3314 1.3349 7.9498 6.6725 1.6828 1.7149 1.5317 1.5318 2.8062 1.2443 1.2444 1.6857 1.5465 1.5583 1.3100 1.4437 1.8451 3.0609 7.6299 2.7131 2.0992 1.7555 6.9219 3.4000 3.3902 2.7004 1.3795 1.6259 3.4517 1.3787 1.3444 1.0541 1.0540 1.0496 1.0530 1.0456 1.0456 1.1086 1.1482 2.4371 2.6480 6.5353 6.6738 6.3966 6.3945 1.0373 1.0373 1.0282 1.0282 1.0977 1.0977 1.0986 1.0986 1.1041 1.1042 1.1055 1.1054 1.0894 1.0893 1.0899 1.0899 1.0951 1.0951
irintensity: 0.1529 5.0944 0.0000 0.7177 8.3861 0.0008 2.9306 0.0000 3.4350 0.0000 0.0000 0.0000 0.0000 7.8428 0.6494 1.8297 0.0000 0.0000 5.9227 0.0000 5.4151 0.0000 2.1406 0.0000 7.6480 0.0000 13.2992 33.3709 0.0000 0.0000 6.8928 5.4060 0.0000 0.0000 44.2513 0.4297 0.0002 1.1112 0.0001 0.0002 93.4989 0.0000 5.3167 1.8631 0.0000 0.0001 3.8602 0.0000 60.2373 20.4579 0.0000 0.0009 21.3665 0.0000 0.0000 0.1800 58.8243 0.0000 21.5866 0.0008 91.7857 0.0000 265.9505 0.0000 70.7879 86.0150 0.0000 0.0000 0.0000 57.8660 0.0000 11.0263 0.0000 13.4416 28.7851 0.0000 0.0014 24.0447 76.1846 0.0004 0.0006 24.1302 0.0004 24.9250 210.3428 0.0000 120.7028 0.0000 0.0000 2.8308 97.1353 0.0353 0.0077 91.8785 0.8170 42.5379 28.3851 0.4478 0.0035 61.6313 105.1092 0.0009 31.8516 0.0067 13.5324 0.0027 34.1034 0.0176
temp: 298.150 k
press: 1.00000 atm
elementType: 8 8 7 7 6 6 6 6 6 6 6 6 6 6 6 6 6 6 6 6 1 1 1 1 1 1 1 1 1 1 1 1 1 1 1 1 1 1
symmnumber: 1
zpe: 795848.9 jmol-1
zpe.correction: 0.303123 hartree
zpe.thermalcorrener: 0.323400 hartree
zpe.thermalcorrenthalpy: 0.324345 hartree
zpe.thermalcorrgfe: 0.252212 hartree
zpe.sumelectzpe: -878.927935 hartree
zpe.sumelectthermal: -878.907658 hartree
zpe.sumelectthermalent: -878.906714 hartree
zpe.sumelectthermalfe: -878.978846 hartree
dipole: 0.0000 0.0000 0.0034
dipole: 0.0034
quadrupole: -103.0729 -106.6906 -122.6544
quadrupole: -11.7981 -0.0063 -0.0168
quadrupole: 7.7331 4.1153 -11.8484 -11.7981 -0.0063 -0.0168
hfenergy: -879.2310583 hartree
pointgroup: C01 [X(C16H18N2O2)]
dipole: 0.0000077 0.0013245 -0.0000224 debye
polarizability: 400.2427799|-2.5713638|93.7843052|-11.8443823|1.5792537|244.8566315 unknown
InChI: InChI=1S/C16H18N2O2/c1-11-5-7-15(19-3)13(9-11)17-18-14-10-12(2)6-8-16(14)20-4/h5-10H,1-4H3
charge 0 multiplicity 1
38 atoms
O  -2.181783 -0.049227 2.920935
O  2.181438 -0.141185 -2.920457
N  -0.341087 -0.086444 0.563158
N  0.340746 -0.102813 -0.562683
C  -3.796556 -0.073194 -1.015702
C  3.796229 -0.114771 1.016156
C  -1.75449 -0.076386 0.406506
C  1.754153 -0.112744 -0.406039
C  -2.402972 -0.083059 -0.871422
C  2.402644 -0.105282 0.87188
C  -2.574858 -0.058652 1.585078
C  2.574517 -0.130812 -1.584609
C  -4.589194 -0.055962 0.173258
C  4.588863 -0.132544 -0.1728
C  -3.991045 -0.048864 1.43847
C  3.990706 -0.140299 -1.438004
C  -4.459761 -0.080092 -2.381877
C  4.459444 -0.106384 2.382317
C  -0.778663 -0.053752 3.358825
C  0.778325 -0.135844 -3.358363
H  -1.751898 -0.096502 -1.750643
H  1.751572 -0.091479 1.751096
H  -5.683167 -0.047998 0.094966
H  5.682838 -0.140231 -0.094511
H  -4.590224 -0.035572 2.353828
H  4.589882 -0.153996 -2.353359
H  -3.712499 -0.095734 -3.193588
H  -5.112714 -0.964514 -2.508344
H  -5.094497 0.814857 -2.525995
H  5.107151 0.781703 2.510282
H  3.712138 -0.096449 3.194078
H  5.099472 -0.997774 2.524882
H  -0.845729 -0.041144 4.458608
H  -0.243259 0.834831 2.983995
H  -0.255288 -0.957592 3.003978
H  0.255522 0.768378 -3.003708
H  0.242351 -1.02403 -2.983354
H  0.845394 -0.148843 -4.458142
