program: Gaussian 09
title: 000293168
version: EM64L-G09RevD.01
frameworkgroup: C1[X(C13H13IO2)]
method: RPBEPBE
basis: SDD
operation: Freq
keyword: #p
keyword: freq=noraman
keyword: PBEPBE/SDD
title: #p freq=noraman PBEPBE/SDD
converged: YES YES NO NO
title: Mulliken charges:
elementType: I O O C C C C C C C C C C C C C H H H H H H H H H H H H H
charge: 0.080190 -0.298787 -0.298719 0.443128 0.425573 -0.618864 0.559074 -0.583112 -0.573335 -0.338207 0.210169 0.211198 -0.522157 -0.830634 -0.529082 -0.529020 0.249459 0.262824 0.263703 0.260303 0.252906 0.230301 0.252914 0.255435 0.223964 0.230781 0.254739 0.224312 0.230945
chargesum: 0.00000
title: Mulliken charges with hydrogens summed into heavy atoms:
elementType: I O O C C C C C C C C C C C C C
charge: 0.080190 -0.298787 -0.298719 0.443128 0.425573 -0.369406 0.559074 -0.320287 -0.309632 -0.077904 0.210169 0.211198 -0.522157 -0.094513 0.181097 0.180975
polarizability: 3.20886773e+02 -5.82928490e+00 1.64370472e+02 1.27467790e+00 -4.92019120e+00 8.12828902e+01
1716.lowfreq: -11.5562 -6.5280 -0.0004 0.0005 0.0005 2.9237 42.8193 61.9820 93.0443
frequency: 42.7973 61.9812 93.0393 103.9215 117.7241 133.1093 163.1555 164.2922 176.3258 183.6483 193.4682 235.6050 244.9864 271.6723 305.4411 336.2381 372.6277 397.1807 427.6205 450.5865 479.8640 498.1198 560.8854 621.2652 626.8722 664.6840 709.4564 730.3849 753.7816 764.9872 818.6404 861.8146 865.6373 916.0906 918.0989 925.9147 950.5742 961.9736 1007.3745 1048.7225 1095.4766 1112.2898 1114.6900 1148.6341 1155.8304 1173.6780 1194.5778 1219.3896 1246.9920 1270.3863 1279.1612 1383.3698 1388.4471 1403.8387 1408.7663 1424.3592 1438.2941 1452.7940 1458.5399 1461.8323 1463.5330 1471.5445 1477.1973 1486.1716 1490.0308 1558.8416 1594.9140 1633.0839 2973.1708 2974.8097 2980.1059 3058.6515 3071.5755 3073.2498 3090.2773 3122.9410 3123.1224 3124.5334 3148.7782 3149.7289 3152.4488
redmass: 4.9167 3.5169 4.2428 2.9978 4.8581 3.3869 1.1556 1.1052 1.4388 2.1136 5.0489 4.4282 3.6571 4.3418 5.6714 5.0970 4.8667 3.6710 5.6969 3.9653 2.6870 4.4991 6.3610 6.0436 5.0441 5.7404 6.2991 4.3097 5.8911 2.4596 4.0548 1.3684 1.3866 1.8486 2.6447 2.3493 6.1879 3.8779 1.5178 1.5317 4.1644 1.2439 1.2571 1.3608 1.4637 1.4439 2.2127 1.3464 6.8346 5.6562 1.2803 3.2673 6.3254 1.2874 2.3461 1.4032 1.4361 2.5103 1.0531 1.2295 1.0451 1.2748 1.0578 1.0753 2.8695 7.0315 6.6846 7.2318 1.0308 1.0310 1.0371 1.0971 1.1039 1.1039 1.0993 1.1030 1.1029 1.0914 1.0918 1.0928 1.0920
irintensity: 0.4929 2.2005 3.3220 8.1878 1.0963 0.4970 0.3465 0.0737 3.1663 2.1331 3.7001 7.5421 3.2064 4.5726 2.4814 1.9660 3.4054 3.7648 10.2498 4.1628 13.8348 2.2474 35.8073 6.6810 1.7757 8.8052 0.8782 11.8408 4.8736 0.0974 6.2410 0.0880 0.8102 4.3831 3.1452 106.1679 53.7384 127.2860 6.7933 11.9183 78.2312 28.3875 2.3178 12.2507 6.9902 59.0357 21.7751 30.1237 15.7881 225.6527 2.7981 0.2633 28.2221 6.8500 6.6356 0.0774 4.5202 18.6900 16.0898 0.9614 13.3926 37.6928 7.5152 9.0843 181.3556 8.4393 28.5662 3.0220 90.4501 79.5756 23.1672 12.4468 30.1865 20.0772 19.2679 22.4357 29.3007 14.2931 4.1620 4.1544 3.2866
temp: 298.150 k
press: 1.00000 atm
elementType: 53 8 8 6 6 6 6 6 6 6 6 6 6 6 6 6 1 1 1 1 1 1 1 1 1 1 1 1 1
symmnumber: 1
zpe: 587430.0 jmol-1
zpe.correction: 0.223740 hartree
zpe.thermalcorrener: 0.239785 hartree
zpe.thermalcorrenthalpy: 0.240730 hartree
zpe.thermalcorrgfe: 0.179151 hartree
zpe.sumelectzpe: -663.953849 hartree
zpe.sumelectthermal: -663.937803 hartree
zpe.sumelectthermalent: -663.936859 hartree
zpe.sumelectthermalfe: -663.998438 hartree
dipole: 2.1679 0.8085 -0.1271
dipole: 2.3172
quadrupole: -95.6461 -100.7201 -110.8934
quadrupole: -4.1242 1.3887 3.4309
quadrupole: 6.7738 1.6997 -8.4735 -4.1242 1.3887 3.4309
hfenergy: -664.1775889 hartree
pointgroup: C01 [X(C13H13I1O2)]
dipole: 0.7888197 0.4388976 -0.1275053 debye
polarizability: 318.6104133|18.5272314|163.9641231|-6.8139328|-15.5897694|83.9655986 unknown
InChI: InChI=1S/C13H13IO2/c1-8-4-9-6-12(15-2)13(16-3)7-10(9)5-11(8)14/h4-7H,1-3H3
charge 0 multiplicity 1
29 atoms
I  -4.910306 -1.612845 0.491287
O  3.133348 1.354125 -0.33171
O  3.061083 -1.475647 0.348398
C  -0.551621 0.736437 -0.173117
C  -0.58552 -0.662431 0.194983
C  -1.789021 1.433879 -0.348844
C  -3.039225 0.819711 -0.17569
C  0.717731 1.380434 -0.330012
C  0.646373 -1.37615 0.350857
C  -1.857587 -1.296455 0.374702
C  1.907018 0.676192 -0.147533
C  1.870474 -0.735013 0.167435
C  -3.035121 -0.571637 0.193636
C  -4.317481 1.606423 -0.37496
C  3.981391 1.441842 0.882192
C  3.893899 -1.612919 -0.871597
H  -1.759462 2.493581 -0.630339
H  0.774592 2.444663 -0.582267
H  0.645807 -2.441779 0.603137
H  -1.889648 -2.354119 0.654105
H  -4.929898 1.620121 0.54584
H  -4.096846 2.649226 -0.657911
H  -4.946867 1.158902 -1.166581
H  4.206226 0.436464 1.280515
H  3.472226 2.048837 1.654421
H  4.904243 1.945744 0.55733
H  4.167921 -0.622198 -1.275979
H  3.347669 -2.195362 -1.637331
H  4.791803 -2.162927 -0.551668
